{"text_format":"1","workbook":"xlsx","n_sheets":11,"sheets":["Skriveni","Upute","RefStr","PRRAS","Bil","RasF","PVRIO","Obv","Kont","Sifre","Prom"],"not_rendered":{"charts":0,"images":0,"macros":0,"external_links":0,"defined_names":21,"comments":2,"pivot_tables":0},"unopened":[],"bounds":{"document_bytes":16777216,"sheet_cells":100000,"rows_first":2000,"rows_last":500,"rows_between":2000,"halvings":0,"cell_chars":16384,"cell_head_chars":4096},"cells_cut":0,"cells_raw":0,"read":"whole","date_system":"1900"}

{"sheet":"Skriveni","index":0,"n_rows":1561,"n_cols":12,"rows_kept":1561,"cut":false,"hidden":true,"merged":[]}
["VP","AOP","IZNOS01","IZNOS02","IZNOS03","IZNOS04","KONTRBR","RAZLIKA","RAZLIKA1","POLJE","TEKST","BROJ"]
[151,{"$f":"PRRAS!C12","v":1},{"$f":"PRRAS!D12","v":7377585},{"$f":"PRRAS!E12","v":7821214},null,null,{"$f":"(B2/1000)*(C2*1+D2*2)","v":23020.012999999999},{"$f":"ABS(C2-ROUND(C2,0))+ABS(D2-ROUND(D2,0))","v":0},0,"VP151",{"$f":"RefStr!B25","v":"DA"},{"$f":"IF(RefStr!B25=\"DA\",1,0)","v":1}]
[151,{"$f":"PRRAS!C13","v":2},{"$f":"PRRAS!D13","v":0},{"$f":"PRRAS!E13","v":0},0,0,0,0,0,"VP152",{"$f":"RefStr!B27","v":"DA"},{"$f":"IF(RefStr!B27=\"DA\",1,0)","v":1}]
[151,{"$f":"PRRAS!C14","v":3},{"$f":"PRRAS!D14","v":0},{"$f":"PRRAS!E14","v":0},0,0,0,0,0,"VP154",{"$f":"RefStr!B29","v":"DA"},{"$f":"IF(RefStr!B29=\"DA\",1,0)","v":1}]
[151,{"$f":"PRRAS!C15","v":4},{"$f":"PRRAS!D15","v":0},{"$f":"PRRAS!E15","v":0},0,0,0,0,0,"VP156",{"$f":"IF(RefStr!B31<>\"\",RefStr!B31, \"NE\")","v":"DA"},{"$f":"IF(RefStr!B31=\"DA\",1,0)","v":1}]
[151,{"$f":"PRRAS!C16","v":5},{"$f":"PRRAS!D16","v":0},{"$f":"PRRAS!E16","v":0},0,0,0,0,0,"VP159",{"$f":"RefStr!B33","v":"DA"},0]
[151,{"$f":"PRRAS!C17","v":6},{"$f":"PRRAS!D17","v":0},{"$f":"PRRAS!E17","v":0},0,0,0,0,0,"RAZDOBLJE",{"$f":"TRIM(RefStr!F6)","v":"2017-12"},{"$f":"IF(RefStr!F6<>0,100*INT(VALUE(MID(RefStr!F6,1,4)))+INT(VALUE(MID(RefStr!F6,6,2))), 0)","v":201712}]
[151,{"$f":"PRRAS!C18","v":7},{"$f":"PRRAS!D18","v":0},{"$f":"PRRAS!E18","v":0},0,0,0,0,0,"DATUMOD",{"$f":"TEXT(RefStr!K10,\"YYYYMMDD\")","v":"20170101"},{"$f":"YEAR(RefStr!K10)*10000+MONTH(RefStr!K10)*100+DAY(RefStr!K10)","v":20170101}]
[151,{"$f":"PRRAS!C19","v":8},{"$f":"PRRAS!D19","v":0},{"$f":"PRRAS!E19","v":0},0,0,0,0,0,"DATUMDO",{"$f":"TEXT(RefStr!K12,\"YYYYMMDD\")","v":"20171231"},{"$f":"YEAR(RefStr!K12)*10000+MONTH(RefStr!K12)*100+DAY(RefStr!K12)","v":20171231}]
[151,{"$f":"PRRAS!C20","v":9},{"$f":"PRRAS!D20","v":0},{"$f":"PRRAS!E20","v":0},0,0,0,0,0,"RKP",{"$f":"TEXT(RefStr!B6,\"00000\")","v":"09431"},{"$f":"INT(VALUE(RefStr!B6))","v":9431}]
[151,{"$f":"PRRAS!C21","v":10},{"$f":"PRRAS!D21","v":0},{"$f":"PRRAS!E21","v":0},0,0,0,0,0,"MATBROJ",{"$f":"TEXT(RefStr!B8,\"00000000\")","v":"03392295"},{"$f":"INT(VALUE(RefStr!B8))","v":3392295}]
[151,{"$f":"PRRAS!C22","v":11},{"$f":"PRRAS!D22","v":0},{"$f":"PRRAS!E22","v":0},0,0,0,0,0,"NAZIV",{"$f":"TRIM(RefStr!B10)","v":"OŠ MLADOST OSIJEK"},{"$f":"LEN(Skriveni!K12)","v":17}]
[151,{"$f":"PRRAS!C23","v":12},{"$f":"PRRAS!D23","v":0},{"$f":"PRRAS!E23","v":0},0,0,0,0,0,"POSTA",{"$f":"TEXT(RefStr!B12,\"00000\")","v":"31000"},{"$f":"INT(VALUE(RefStr!B12))","v":31000}]
[151,{"$f":"PRRAS!C24","v":13},{"$f":"PRRAS!D24","v":0},{"$f":"PRRAS!E24","v":0},0,0,0,0,0,"MJESTO",{"$f":"TRIM(RefStr!C12)","v":"OSIJEK"},{"$f":"LEN(Skriveni!K14)","v":6}]
[151,{"$f":"PRRAS!C25","v":14},{"$f":"PRRAS!D25","v":0},{"$f":"PRRAS!E25","v":0},0,0,0,0,0,"ADRESA",{"$f":"TRIM(RefStr!B14)","v":"SJENJAK 7"},{"$f":"LEN(Skriveni!K15)","v":9}]
[151,{"$f":"PRRAS!C26","v":15},{"$f":"PRRAS!D26","v":0},{"$f":"PRRAS!E26","v":0},0,0,0,0,0,"RAZINA",{"$f":"TEXT(RefStr!B16,\"00\")","v":"31"},{"$f":"INT(VALUE(RefStr!B16))","v":31}]
[151,{"$f":"PRRAS!C27","v":16},{"$f":"PRRAS!D27","v":0},{"$f":"PRRAS!E27","v":0},0,0,0,0,0,"DJELAT",{"$f":"TEXT(RefStr!B18,\"0000\")","v":"8520"},{"$f":"INT(VALUE(RefStr!B18))","v":8520}]
[151,{"$f":"PRRAS!C28","v":17},{"$f":"PRRAS!D28","v":0},{"$f":"PRRAS!E28","v":0},0,0,0,0,0,"RAZDJEL",{"$f":"TEXT(RefStr!B20,\"000\")","v":"000"},{"$f":"INT(VALUE(RefStr!B20))","v":0}]
[151,{"$f":"PRRAS!C29","v":18},{"$f":"PRRAS!D29","v":0},{"$f":"PRRAS!E29","v":0},0,0,0,0,0,"OPCINA",{"$f":"TEXT(RefStr!B22,\"000\")","v":"312"},{"$f":"INT(VALUE(RefStr!B22))","v":312}]
[151,{"$f":"PRRAS!C30","v":19},{"$f":"PRRAS!D30","v":0},{"$f":"PRRAS!E30","v":0},0,0,0,0,0,"ZUPANIJA",{"$f":"IF(ISNUMBER(RefStr!H2), TEXT(RefStr!H2, \"00\"),\"00\")","v":"14"},{"$f":"IF(ISERROR(RefStr!H2),0,INT(VALUE(RefStr!H2)))","v":14}]
[151,{"$f":"PRRAS!C31","v":20},{"$f":"PRRAS!D31","v":0},{"$f":"PRRAS!E31","v":0},0,0,0,0,0,"OIB",{"$f":"TEXT(RefStr!K14, \"00000000000\")","v":"19998137302"},{"$f":"INT(VALUE(RefStr!K14))","v":19998137302}]
[151,{"$f":"PRRAS!C32","v":21},{"$f":"PRRAS!D32","v":0},{"$f":"PRRAS!E32","v":0},0,0,0,0,0,"KONTAKT",{"$f":"TRIM(RefStr!H25)","v":"Robertina Filić"},{"$f":"LEN(RefStr!H25)","v":15}]
[151,{"$f":"PRRAS!C33","v":22},{"$f":"PRRAS!D33","v":0},{"$f":"PRRAS!E33","v":0},0,0,0,0,0,"TEL",{"$f":"TRIM(RefStr!H27)","v":"031496682"},{"$f":"LEN(RefStr!H27)","v":9}]
[151,{"$f":"PRRAS!C34","v":23},{"$f":"PRRAS!D34","v":0},{"$f":"PRRAS!E34","v":0},0,0,0,0,0,"FAX",{"$f":"TRIM(RefStr!K27)","v":"031574913"},{"$f":"LEN(RefStr!K27)","v":9}]
[151,{"$f":"PRRAS!C35","v":24},{"$f":"PRRAS!D35","v":0},{"$f":"PRRAS!E35","v":0},0,0,0,0,0,"E_POSTA",{"$f":"TRIM(RefStr!H29)","v":"ured@os-mladost-os.skole.hr"},{"$f":"LEN(RefStr!H29)","v":27}]
[151,{"$f":"PRRAS!C36","v":25},{"$f":"PRRAS!D36","v":0},{"$f":"PRRAS!E36","v":0},0,0,0,0,0,"E_POSTAOBV",{"$f":"TRIM(RefStr!H31)","v":""},{"$f":"LEN(RefStr!H31)","v":0}]
[151,{"$f":"PRRAS!C37","v":26},{"$f":"PRRAS!D37","v":0},{"$f":"PRRAS!E37","v":0},0,0,0,0,0,"ZAK_PREDST",{"$f":"TRIM(RefStr!H33)","v":"JOSIP JUKIĆ"},{"$f":"LEN(RefStr!H33)","v":11}]
[151,{"$f":"PRRAS!C38","v":27},{"$f":"PRRAS!D38","v":0},{"$f":"PRRAS!E38","v":0},0,0,0,0,0,"KONTBR",{"$f":"SUM(G2:G1561)","v":110541620.27400006},{"$f":"SUM(G2:G1561)","v":110541620.27400006}]
[151,{"$f":"PRRAS!C39","v":28},{"$f":"PRRAS!D39","v":0},{"$f":"PRRAS!E39","v":0},0,0,0,0,0,"RAZLIKA",{"$f":"IF(SUM(H2:H1561)<>0,\"LIPE\",\"NULA\")","v":"NULA"},{"$f":"SUM(H2:H1561)","v":0}]
[151,{"$f":"PRRAS!C40","v":29},{"$f":"PRRAS!D40","v":0},{"$f":"PRRAS!E40","v":0},0,0,0,0,0,"BRKONT",{"$f":"TEXT(Kont!E3, \"000\")","v":"000"},{"$f":"IF(ISERROR(Kont!E3),1,Kont!E3)","v":0}]
[151,{"$f":"PRRAS!C41","v":30},{"$f":"PRRAS!D41","v":0},{"$f":"PRRAS!E41","v":0},0,0,0,0,0,"VER","504",504]
[151,{"$f":"PRRAS!C42","v":31},{"$f":"PRRAS!D42","v":0},{"$f":"PRRAS!E42","v":0},0,0,0,0,0,"KONS_ISTI",{"$f":"IF(RefStr!I8 = \"DA\",\"DA\",\"NE\")","v":"NE"}]
[151,{"$f":"PRRAS!C43","v":32},{"$f":"PRRAS!D43","v":0},{"$f":"PRRAS!E43","v":0},0,0,0,0,0,"KBR_151",null,{"$f":"PRRAS!E4","v":95496472.04400003}]
[151,{"$f":"PRRAS!C44","v":33},{"$f":"PRRAS!D44","v":0},{"$f":"PRRAS!E44","v":0},0,0,0,0,0,"KBR_152",null,{"$f":"Bil!E4","v":3550769.5920000002}]
[151,{"$f":"PRRAS!C45","v":34},{"$f":"PRRAS!D45","v":0},{"$f":"PRRAS!E45","v":0},0,0,0,0,0,"KBR_154",null,{"$f":"RasF!E4","v":10764600.587000001}]
[151,{"$f":"PRRAS!C46","v":35},{"$f":"PRRAS!D46","v":0},{"$f":"PRRAS!E46","v":0},0,0,0,0,0,"KBR_156",null,{"$f":"PVRIO!D4","v":4167.098}]
[151,{"$f":"PRRAS!C47","v":36},{"$f":"PRRAS!D47","v":0},{"$f":"PRRAS!E47","v":0},0,0,0,0,0,"KBR_159",null,{"$f":"Obv!C4","v":725610.9530000001}]
[151,{"$f":"PRRAS!C48","v":37},{"$f":"PRRAS!D48","v":0},{"$f":"PRRAS!E48","v":0},0,0,0,0,0]
[151,{"$f":"PRRAS!C49","v":38},{"$f":"PRRAS!D49","v":0},{"$f":"PRRAS!E49","v":0},0,0,0,0,0]
[151,{"$f":"PRRAS!C50","v":39},{"$f":"PRRAS!D50","v":0},{"$f":"PRRAS!E50","v":0},0,0,0,0,0]
[151,{"$f":"PRRAS!C51","v":40},{"$f":"PRRAS!D51","v":0},{"$f":"PRRAS!E51","v":0},0,0,0,0,0]
[151,{"$f":"PRRAS!C52","v":41},{"$f":"PRRAS!D52","v":0},{"$f":"PRRAS!E52","v":0},0,0,0,0,0]
[151,{"$f":"PRRAS!C53","v":42},{"$f":"PRRAS!D53","v":0},{"$f":"PRRAS!E53","v":0},0,0,0,0,0]
[151,{"$f":"PRRAS!C54","v":43},{"$f":"PRRAS!D54","v":0},{"$f":"PRRAS!E54","v":0},0,0,0,0,0]
[151,{"$f":"PRRAS!C55","v":44},{"$f":"PRRAS!D55","v":0},{"$f":"PRRAS!E55","v":0},0,0,0,0,0]
[151,{"$f":"PRRAS!C56","v":45},{"$f":"PRRAS!D56","v":5905381},{"$f":"PRRAS!E56","v":6257250},0,0,828894.64500000002,0,0]
[151,{"$f":"PRRAS!C57","v":46},{"$f":"PRRAS!D57","v":0},{"$f":"PRRAS!E57","v":0},0,0,0,0,0]
[151,{"$f":"PRRAS!C58","v":47},{"$f":"PRRAS!D58","v":0},{"$f":"PRRAS!E58","v":0},0,0,0,0,0]
[151,{"$f":"PRRAS!C59","v":48},{"$f":"PRRAS!D59","v":0},{"$f":"PRRAS!E59","v":0},0,0,0,0,0]
[151,{"$f":"PRRAS!C60","v":49},{"$f":"PRRAS!D60","v":0},{"$f":"PRRAS!E60","v":0},0,0,0,0,0]
[151,{"$f":"PRRAS!C61","v":50},{"$f":"PRRAS!D61","v":0},{"$f":"PRRAS!E61","v":0},0,0,0,0,0]
[151,{"$f":"PRRAS!C62","v":51},{"$f":"PRRAS!D62","v":0},{"$f":"PRRAS!E62","v":0},0,0,0,0,0]
[151,{"$f":"PRRAS!C63","v":52},{"$f":"PRRAS!D63","v":0},{"$f":"PRRAS!E63","v":0},0,0,0,0,0]
[151,{"$f":"PRRAS!C64","v":53},{"$f":"PRRAS!D64","v":0},{"$f":"PRRAS!E64","v":0},0,0,0,0,0]
[151,{"$f":"PRRAS!C65","v":54},{"$f":"PRRAS!D65","v":3366},{"$f":"PRRAS!E65","v":0},0,0,181.76400000000001,0,0]
[151,{"$f":"PRRAS!C66","v":55},{"$f":"PRRAS!D66","v":3366},{"$f":"PRRAS!E66","v":0},0,0,185.13,0,0]
[151,{"$f":"PRRAS!C67","v":56},{"$f":"PRRAS!D67","v":0},{"$f":"PRRAS!E67","v":0},0,0,0,0,0]
[151,{"$f":"PRRAS!C68","v":57},{"$f":"PRRAS!D68","v":0},{"$f":"PRRAS!E68","v":0},0,0,0,0,0]
[151,{"$f":"PRRAS!C69","v":58},{"$f":"PRRAS!D69","v":0},{"$f":"PRRAS!E69","v":0},0,0,0,0,0]
[151,{"$f":"PRRAS!C70","v":59},{"$f":"PRRAS!D70","v":0},{"$f":"PRRAS!E70","v":0},0,0,0,0,0]
[151,{"$f":"PRRAS!C71","v":60},{"$f":"PRRAS!D71","v":0},{"$f":"PRRAS!E71","v":0},0,0,0,0,0]
[151,{"$f":"PRRAS!C72","v":61},{"$f":"PRRAS!D72","v":0},{"$f":"PRRAS!E72","v":0},0,0,0,0,0]
[151,{"$f":"PRRAS!C73","v":62},{"$f":"PRRAS!D73","v":0},{"$f":"PRRAS!E73","v":0},0,0,0,0,0]
[151,{"$f":"PRRAS!C74","v":63},{"$f":"PRRAS!D74","v":5902015},{"$f":"PRRAS!E74","v":6257250},0,0,1160240.4450000001,0,0]
[151,{"$f":"PRRAS!C75","v":64},{"$f":"PRRAS!D75","v":5902015},{"$f":"PRRAS!E75","v":6257250},0,0,1178656.96,0,0]
[151,{"$f":"PRRAS!C76","v":65},{"$f":"PRRAS!D76","v":0},{"$f":"PRRAS!E76","v":0},0,0,{"$f":"(B66/1000)*(C66*1+D66*2)","v":0},{"$f":"ABS(C66-ROUND(C66,0))+ABS(D66-ROUND(D66,0))","v":0},0]
[151,{"$f":"PRRAS!C77","v":66},{"$f":"PRRAS!D77","v":0},{"$f":"PRRAS!E77","v":0},0,0,0,0,0]
[151,{"$f":"PRRAS!C78","v":67},{"$f":"PRRAS!D78","v":0},{"$f":"PRRAS!E78","v":0},0,0,0,0,0]
[151,{"$f":"PRRAS!C79","v":68},{"$f":"PRRAS!D79","v":0},{"$f":"PRRAS!E79","v":0},0,0,0,0,0]
[151,{"$f":"PRRAS!C80","v":69},{"$f":"PRRAS!D80","v":0},{"$f":"PRRAS!E80","v":0},0,0,0,0,0]
[151,{"$f":"PRRAS!C81","v":70},{"$f":"PRRAS!D81","v":0},{"$f":"PRRAS!E81","v":0},0,0,0,0,0]
[151,{"$f":"PRRAS!C82","v":71},{"$f":"PRRAS!D82","v":0},{"$f":"PRRAS!E82","v":0},0,0,0,0,0]
[151,{"$f":"PRRAS!C83","v":72},{"$f":"PRRAS!D83","v":0},{"$f":"PRRAS!E83","v":0},0,0,0,0,0]
[151,{"$f":"PRRAS!C84","v":73},{"$f":"PRRAS!D84","v":0},{"$f":"PRRAS!E84","v":0},0,0,0,0,0]
[151,{"$f":"PRRAS!C85","v":74},{"$f":"PRRAS!D85","v":226},{"$f":"PRRAS!E85","v":86},0,0,29.451999999999998,0,0]
[151,{"$f":"PRRAS!C86","v":75},{"$f":"PRRAS!D86","v":226},{"$f":"PRRAS!E86","v":86},0,0,29.849999999999998,0,0]
[151,{"$f":"PRRAS!C87","v":76},{"$f":"PRRAS!D87","v":0},{"$f":"PRRAS!E87","v":0},0,0,0,0,0]
[151,{"$f":"PRRAS!C88","v":77},{"$f":"PRRAS!D88","v":226},{"$f":"PRRAS!E88","v":86},0,0,30.646000000000001,0,0]
[151,{"$f":"PRRAS!C89","v":78},{"$f":"PRRAS!D89","v":0},{"$f":"PRRAS!E89","v":0},0,0,0,0,0]
[151,{"$f":"PRRAS!C90","v":79},{"$f":"PRRAS!D90","v":0},{"$f":"PRRAS!E90","v":0},0,0,0,0,0]
[151,{"$f":"PRRAS!C91","v":80},{"$f":"PRRAS!D91","v":0},{"$f":"PRRAS!E91","v":0},0,0,0,0,0]
[151,{"$f":"PRRAS!C92","v":81},{"$f":"PRRAS!D92","v":0},{"$f":"PRRAS!E92","v":0},0,0,0,0,0]
[151,{"$f":"PRRAS!C93","v":82},{"$f":"PRRAS!D93","v":0},{"$f":"PRRAS!E93","v":0},0,0,0,0,0]
[151,{"$f":"PRRAS!C94","v":83},{"$f":"PRRAS!D94","v":0},{"$f":"PRRAS!E94","v":0},0,0,0,0,0]
[151,{"$f":"PRRAS!C95","v":84},{"$f":"PRRAS!D95","v":0},{"$f":"PRRAS!E95","v":0},0,0,0,0,0]
[151,{"$f":"PRRAS!C96","v":85},{"$f":"PRRAS!D96","v":0},{"$f":"PRRAS!E96","v":0},0,0,0,0,0]
[151,{"$f":"PRRAS!C97","v":86},{"$f":"PRRAS!D97","v":0},{"$f":"PRRAS!E97","v":0},0,0,0,0,0]
[151,{"$f":"PRRAS!C98","v":87},{"$f":"PRRAS!D98","v":0},{"$f":"PRRAS!E98","v":0},0,0,0,0,0]
[151,{"$f":"PRRAS!C99","v":88},{"$f":"PRRAS!D99","v":0},{"$f":"PRRAS!E99","v":0},0,0,0,0,0]
[151,{"$f":"PRRAS!C100","v":89},{"$f":"PRRAS!D100","v":0},{"$f":"PRRAS!E100","v":0},0,0,0,0,0]
[151,{"$f":"PRRAS!C101","v":90},{"$f":"PRRAS!D101","v":0},{"$f":"PRRAS!E101","v":0},0,0,0,0,0]
[151,{"$f":"PRRAS!C102","v":91},{"$f":"PRRAS!D102","v":0},{"$f":"PRRAS!E102","v":0},0,0,0,0,0]
[151,{"$f":"PRRAS!C103","v":92},{"$f":"PRRAS!D103","v":0},{"$f":"PRRAS!E103","v":0},0,0,0,0,0]
[151,{"$f":"PRRAS!C104","v":93},{"$f":"PRRAS!D104","v":0},{"$f":"PRRAS!E104","v":0},0,0,0,0,0]
[151,{"$f":"PRRAS!C105","v":94},{"$f":"PRRAS!D105","v":0},{"$f":"PRRAS!E105","v":0},0,0,0,0,0]
[151,{"$f":"PRRAS!C106","v":95},{"$f":"PRRAS!D106","v":0},{"$f":"PRRAS!E106","v":0},0,0,0,0,0]
[151,{"$f":"PRRAS!C107","v":96},{"$f":"PRRAS!D107","v":0},{"$f":"PRRAS!E107","v":0},0,0,0,0,0]
[151,{"$f":"PRRAS!C108","v":97},{"$f":"PRRAS!D108","v":0},{"$f":"PRRAS!E108","v":0},0,0,0,0,0]
[151,{"$f":"PRRAS!C109","v":98},{"$f":"PRRAS!D109","v":0},{"$f":"PRRAS!E109","v":0},0,0,0,0,0]
[151,{"$f":"PRRAS!C110","v":99},{"$f":"PRRAS!D110","v":0},{"$f":"PRRAS!E110","v":0},0,0,0,0,0]
[151,{"$f":"PRRAS!C111","v":100},{"$f":"PRRAS!D111","v":0},{"$f":"PRRAS!E111","v":0},0,0,0,0,0]
[151,{"$f":"PRRAS!C112","v":101},{"$f":"PRRAS!D112","v":0},{"$f":"PRRAS!E112","v":0},0,0,0,0,0]
[151,{"$f":"PRRAS!C113","v":102},{"$f":"PRRAS!D113","v":0},{"$f":"PRRAS!E113","v":0},0,0,0,0,0]
[151,{"$f":"PRRAS!C114","v":103},{"$f":"PRRAS!D114","v":0},{"$f":"PRRAS!E114","v":0},0,0,0,0,0]
[151,{"$f":"PRRAS!C115","v":104},{"$f":"PRRAS!D115","v":0},{"$f":"PRRAS!E115","v":0},0,0,0,0,0]
[151,{"$f":"PRRAS!C116","v":105},{"$f":"PRRAS!D116","v":484200},{"$f":"PRRAS!E116","v":490122},0,0,153766.62,0,0]
[151,{"$f":"PRRAS!C117","v":106},{"$f":"PRRAS!D117","v":0},{"$f":"PRRAS!E117","v":0},0,0,0,0,0]
[151,{"$f":"PRRAS!C118","v":107},{"$f":"PRRAS!D118","v":0},{"$f":"PRRAS!E118","v":0},0,0,0,0,0]
[151,{"$f":"PRRAS!C119","v":108},{"$f":"PRRAS!D119","v":0},{"$f":"PRRAS!E119","v":0},0,0,0,0,0]
[151,{"$f":"PRRAS!C120","v":109},{"$f":"PRRAS!D120","v":0},{"$f":"PRRAS!E120","v":0},0,0,0,0,0]
[151,{"$f":"PRRAS!C121","v":110},{"$f":"PRRAS!D121","v":0},{"$f":"PRRAS!E121","v":0},0,0,0,0,0]
[151,{"$f":"PRRAS!C122","v":111},{"$f":"PRRAS!D122","v":484200},{"$f":"PRRAS!E122","v":490122},0,0,162553.28400000001,0,0]
[151,{"$f":"PRRAS!C123","v":112},{"$f":"PRRAS!D123","v":0},{"$f":"PRRAS!E123","v":0},0,0,0,0,0]
[151,{"$f":"PRRAS!C124","v":113},{"$f":"PRRAS!D124","v":0},{"$f":"PRRAS!E124","v":0},0,0,0,0,0]
[151,{"$f":"PRRAS!C125","v":114},{"$f":"PRRAS!D125","v":0},{"$f":"PRRAS!E125","v":0},0,0,0,0,0]
[151,{"$f":"PRRAS!C126","v":115},{"$f":"PRRAS!D126","v":0},{"$f":"PRRAS!E126","v":0},0,0,0,0,0]
[151,{"$f":"PRRAS!C127","v":116},{"$f":"PRRAS!D127","v":484200},{"$f":"PRRAS!E127","v":490122},0,0,169875.50400000002,0,0]
[151,{"$f":"PRRAS!C128","v":117},{"$f":"PRRAS!D128","v":0},{"$f":"PRRAS!E128","v":0},0,0,0,0,0]
[151,{"$f":"PRRAS!C129","v":118},{"$f":"PRRAS!D129","v":0},{"$f":"PRRAS!E129","v":0},0,0,0,0,0]
[151,{"$f":"PRRAS!C130","v":119},{"$f":"PRRAS!D130","v":0},{"$f":"PRRAS!E130","v":0},0,0,0,0,0]
[151,{"$f":"PRRAS!C131","v":120},{"$f":"PRRAS!D131","v":0},{"$f":"PRRAS!E131","v":0},0,0,0,0,0]
[151,{"$f":"PRRAS!C132","v":121},{"$f":"PRRAS!D132","v":0},{"$f":"PRRAS!E132","v":0},0,0,0,0,0]
[151,{"$f":"PRRAS!C133","v":122},{"$f":"PRRAS!D133","v":0},{"$f":"PRRAS!E133","v":0},0,0,0,0,0]
[151,{"$f":"PRRAS!C134","v":123},{"$f":"PRRAS!D134","v":126805},{"$f":"PRRAS!E134","v":166887},0,0,56651.216999999997,0,0]
[151,{"$f":"PRRAS!C135","v":124},{"$f":"PRRAS!D135","v":126805},{"$f":"PRRAS!E135","v":166887},0,0,57111.796000000002,0,0]
[151,{"$f":"PRRAS!C136","v":125},{"$f":"PRRAS!D136","v":0},{"$f":"PRRAS!E136","v":0},0,0,0,0,0]
[151,{"$f":"PRRAS!C137","v":126},{"$f":"PRRAS!D137","v":126805},{"$f":"PRRAS!E137","v":166887},0,0,58032.953999999998,0,0]
[151,{"$f":"PRRAS!C138","v":127},{"$f":"PRRAS!D138","v":0},{"$f":"PRRAS!E138","v":0},0,0,0,0,0]
[151,{"$f":"PRRAS!C139","v":128},{"$f":"PRRAS!D139","v":0},{"$f":"PRRAS!E139","v":0},0,0,0,0,0]
[151,{"$f":"PRRAS!C140","v":129},{"$f":"PRRAS!D140","v":0},{"$f":"PRRAS!E140","v":0},0,0,{"$f":"(B130/1000)*(C130*1+D130*2)","v":0},{"$f":"ABS(C130-ROUND(C130,0))+ABS(D130-ROUND(D130,0))","v":0},0]
[151,{"$f":"PRRAS!C141","v":130},{"$f":"PRRAS!D141","v":860973},{"$f":"PRRAS!E141","v":906869},0,0,347712.43,0,0]
[151,{"$f":"PRRAS!C142","v":131},{"$f":"PRRAS!D142","v":860973},{"$f":"PRRAS!E142","v":906869},0,0,350387.141,0,0]
[151,{"$f":"PRRAS!C143","v":132},{"$f":"PRRAS!D143","v":860973},{"$f":"PRRAS!E143","v":906869},0,0,353061.85200000001,0,0]
[151,{"$f":"PRRAS!C144","v":133},{"$f":"PRRAS!D144","v":0},{"$f":"PRRAS!E144","v":0},0,0,0,0,0]
[151,{"$f":"PRRAS!C145","v":134},{"$f":"PRRAS!D145","v":0},{"$f":"PRRAS!E145","v":0},0,0,0,0,0]
[151,{"$f":"PRRAS!C146","v":135},{"$f":"PRRAS!D146","v":0},{"$f":"PRRAS!E146","v":0},0,0,0,0,0]
[151,{"$f":"PRRAS!C147","v":136},{"$f":"PRRAS!D147","v":0},{"$f":"PRRAS!E147","v":0},0,0,0,0,0]
[151,{"$f":"PRRAS!C148","v":137},{"$f":"PRRAS!D148","v":0},{"$f":"PRRAS!E148","v":0},0,0,0,0,0]
[151,{"$f":"PRRAS!C149","v":138},{"$f":"PRRAS!D149","v":0},{"$f":"PRRAS!E149","v":0},0,0,0,0,0]
[151,{"$f":"PRRAS!C150","v":139},{"$f":"PRRAS!D150","v":0},{"$f":"PRRAS!E150","v":0},0,0,0,0,0]
[151,{"$f":"PRRAS!C151","v":140},{"$f":"PRRAS!D151","v":0},{"$f":"PRRAS!E151","v":0},0,0,0,0,0]
[151,{"$f":"PRRAS!C152","v":141},{"$f":"PRRAS!D152","v":0},{"$f":"PRRAS!E152","v":0},0,0,0,0,0]
[151,{"$f":"PRRAS!C153","v":142},{"$f":"PRRAS!D153","v":0},{"$f":"PRRAS!E153","v":0},0,0,0,0,0]
[151,{"$f":"PRRAS!C154","v":143},{"$f":"PRRAS!D154","v":0},{"$f":"PRRAS!E154","v":0},0,0,0,0,0]
[151,{"$f":"PRRAS!C155","v":144},{"$f":"PRRAS!D155","v":0},{"$f":"PRRAS!E155","v":0},0,0,0,0,0]
[151,{"$f":"PRRAS!C156","v":145},{"$f":"PRRAS!D156","v":0},{"$f":"PRRAS!E156","v":0},0,0,0,0,0]
[151,{"$f":"PRRAS!C157","v":146},{"$f":"PRRAS!D157","v":0},{"$f":"PRRAS!E157","v":0},0,0,0,0,0]
[151,{"$f":"PRRAS!C158","v":147},{"$f":"PRRAS!D158","v":0},{"$f":"PRRAS!E158","v":0},0,0,0,0,0]
[151,{"$f":"PRRAS!C159","v":148},{"$f":"PRRAS!D159","v":7344045},{"$f":"PRRAS!E159","v":7840643},0,0,3407748.9879999999,0,0]
[151,{"$f":"PRRAS!C160","v":149},{"$f":"PRRAS!D160","v":5955536},{"$f":"PRRAS!E160","v":6259741},0,0,2752777.682,0,0]
[151,{"$f":"PRRAS!C161","v":150},{"$f":"PRRAS!D161","v":4825040},{"$f":"PRRAS!E161","v":5043876},0,0,2236918.7999999998,0,0]
[151,{"$f":"PRRAS!C162","v":151},{"$f":"PRRAS!D162","v":4804533},{"$f":"PRRAS!E162","v":5023864},0,0,2242691.4109999998,0,0]
[151,{"$f":"PRRAS!C163","v":152},{"$f":"PRRAS!D163","v":0},{"$f":"PRRAS!E163","v":0},0,0,0,0,0]
[151,{"$f":"PRRAS!C164","v":153},{"$f":"PRRAS!D164","v":20507},{"$f":"PRRAS!E164","v":20012},0,0,9261.2430000000004,0,0]
[151,{"$f":"PRRAS!C165","v":154},{"$f":"PRRAS!D165","v":0},{"$f":"PRRAS!E165","v":0},0,0,0,0,0]
[151,{"$f":"PRRAS!C166","v":155},{"$f":"PRRAS!D166","v":306437},{"$f":"PRRAS!E166","v":359985},0,0,159093.08499999999,0,0]
[151,{"$f":"PRRAS!C167","v":156},{"$f":"PRRAS!D167","v":824059},{"$f":"PRRAS!E167","v":855880},0,0,395587.76400000002,0,0]
[151,{"$f":"PRRAS!C168","v":157},{"$f":"PRRAS!D168","v":0},{"$f":"PRRAS!E168","v":0},0,0,0,0,0]
[151,{"$f":"PRRAS!C169","v":158},{"$f":"PRRAS!D169","v":742612},{"$f":"PRRAS!E169","v":771287},0,0,361059.38799999998,0,0]
[151,{"$f":"PRRAS!C170","v":159},{"$f":"PRRAS!D170","v":81447},{"$f":"PRRAS!E170","v":84593},0,0,39850.646999999997,0,0]
[151,{"$f":"PRRAS!C171","v":160},{"$f":"PRRAS!D171","v":1380197},{"$f":"PRRAS!E171","v":1543744},0,0,714829.6,0,0]
[151,{"$f":"PRRAS!C172","v":161},{"$f":"PRRAS!D172","v":132122},{"$f":"PRRAS!E172","v":151407},0,0,70024.695999999996,0,0]
[151,{"$f":"PRRAS!C173","v":162},{"$f":"PRRAS!D173","v":25216},{"$f":"PRRAS!E173","v":38243},0,0,16475.724000000002,0,0]
[151,{"$f":"PRRAS!C174","v":163},{"$f":"PRRAS!D174","v":104276},{"$f":"PRRAS!E174","v":107166},0,0,51933.103999999999,0,0]
[151,{"$f":"PRRAS!C175","v":164},{"$f":"PRRAS!D175","v":1700},{"$f":"PRRAS!E175","v":430},0,0,419.84000000000003,0,0]
[151,{"$f":"PRRAS!C176","v":165},{"$f":"PRRAS!D176","v":930},{"$f":"PRRAS!E176","v":5568},0,0,1990.89,0,0]
[151,{"$f":"PRRAS!C177","v":166},{"$f":"PRRAS!D177","v":1002953},{"$f":"PRRAS!E177","v":1122074},0,0,539018.76600000006,0,0]
[151,{"$f":"PRRAS!C178","v":167},{"$f":"PRRAS!D178","v":49700},{"$f":"PRRAS!E178","v":49453},0,0,24817.202000000001,0,0]
[151,{"$f":"PRRAS!C179","v":168},{"$f":"PRRAS!D179","v":417950},{"$f":"PRRAS!E179","v":460815},0,0,225049.44,0,0]
[151,{"$f":"PRRAS!C180","v":169},{"$f":"PRRAS!D180","v":498015},{"$f":"PRRAS!E180","v":533639},0,0,264534.51699999999,0,0]
[151,{"$f":"PRRAS!C181","v":170},{"$f":"PRRAS!D181","v":24137},{"$f":"PRRAS!E181","v":74652},0,0,29484.97,0,0]
[151,{"$f":"PRRAS!C182","v":171},{"$f":"PRRAS!D182","v":12851},{"$f":"PRRAS!E182","v":3515},0,0,3399.6510000000003,0,0]
[151,{"$f":"PRRAS!C183","v":172},{"$f":"PRRAS!D183","v":0},{"$f":"PRRAS!E183","v":0},0,0,0,0,0]
[151,{"$f":"PRRAS!C184","v":173},{"$f":"PRRAS!D184","v":300},{"$f":"PRRAS!E184","v":0},0,0,51.9,0,0]
[151,{"$f":"PRRAS!C185","v":174},{"$f":"PRRAS!D185","v":220400},{"$f":"PRRAS!E185","v":218158},0,0,114268.58399999999,0,0]
[151,{"$f":"PRRAS!C186","v":175},{"$f":"PRRAS!D186","v":17936},{"$f":"PRRAS!E186","v":17328},0,0,9203.5999999999985,0,0]
[151,{"$f":"PRRAS!C187","v":176},{"$f":"PRRAS!D187","v":90018},{"$f":"PRRAS!E187","v":75007},0,0,42245.631999999998,0,0]
[151,{"$f":"PRRAS!C188","v":177},{"$f":"PRRAS!D188","v":2785},{"$f":"PRRAS!E188","v":3520},0,0,1739.0249999999999,0,0]
[151,{"$f":"PRRAS!C189","v":178},{"$f":"PRRAS!D189","v":49383},{"$f":"PRRAS!E189","v":48063},0,0,25900.601999999999,0,0]
[151,{"$f":"PRRAS!C190","v":179},{"$f":"PRRAS!D190","v":0},{"$f":"PRRAS!E190","v":0},0,0,0,0,0]
[151,{"$f":"PRRAS!C191","v":180},{"$f":"PRRAS!D191","v":13638},{"$f":"PRRAS!E191","v":19414},0,0,9443.8799999999992,0,0]
[151,{"$f":"PRRAS!C192","v":181},{"$f":"PRRAS!D192","v":20957},{"$f":"PRRAS!E192","v":30883},0,0,14972.862999999999,0,0]
[151,{"$f":"PRRAS!C193","v":182},{"$f":"PRRAS!D193","v":6000},{"$f":"PRRAS!E193","v":6562},0,0,3480.5679999999998,0,0]
[151,{"$f":"PRRAS!C194","v":183},{"$f":"PRRAS!D194","v":19683},{"$f":"PRRAS!E194","v":17381},0,0,9963.4349999999995,0,0]
[151,{"$f":"PRRAS!C195","v":184},{"$f":"PRRAS!D195","v":0},{"$f":"PRRAS!E195","v":0},0,0,0,0,0]
[151,{"$f":"PRRAS!C196","v":185},{"$f":"PRRAS!D196","v":24722},{"$f":"PRRAS!E196","v":52105},0,0,23852.42,0,0]
[151,{"$f":"PRRAS!C197","v":186},{"$f":"PRRAS!D197","v":0},{"$f":"PRRAS!E197","v":0},0,0,0,0,0]
[151,{"$f":"PRRAS!C198","v":187},{"$f":"PRRAS!D198","v":0},{"$f":"PRRAS!E198","v":0},0,0,0,0,0]
[151,{"$f":"PRRAS!C199","v":188},{"$f":"PRRAS!D199","v":4108},{"$f":"PRRAS!E199","v":7670},0,0,3656.2240000000002,0,0]
[151,{"$f":"PRRAS!C200","v":189},{"$f":"PRRAS!D200","v":0},{"$f":"PRRAS!E200","v":1000},0,0,378,0,0]
[151,{"$f":"PRRAS!C201","v":190},{"$f":"PRRAS!D201","v":9360},{"$f":"PRRAS!E201","v":13759},0,0,7006.82,0,0]
[151,{"$f":"PRRAS!C202","v":191},{"$f":"PRRAS!D202","v":0},{"$f":"PRRAS!E202","v":21908},0,0,8368.8559999999998,0,0]
[151,{"$f":"PRRAS!C203","v":192},{"$f":"PRRAS!D203","v":11254},{"$f":"PRRAS!E203","v":7768},0,0,5143.68,0,0]
[151,{"$f":"PRRAS!C204","v":193},{"$f":"PRRAS!D204","v":8312},{"$f":"PRRAS!E204","v":37158},0,0,{"$f":"(B194/1000)*(C194*1+D194*2)","v":15947.204},{"$f":"ABS(C194-ROUND(C194,0))+ABS(D194-ROUND(D194,0))","v":0},0]
[151,{"$f":"PRRAS!C205","v":194},{"$f":"PRRAS!D205","v":0},{"$f":"PRRAS!E205","v":0},0,0,0,0,0]
[151,{"$f":"PRRAS!C206","v":195},{"$f":"PRRAS!D206","v":0},{"$f":"PRRAS!E206","v":0},0,0,0,0,0]
[151,{"$f":"PRRAS!C207","v":196},{"$f":"PRRAS!D207","v":0},{"$f":"PRRAS!E207","v":0},0,0,0,0,0]
[151,{"$f":"PRRAS!C208","v":197},{"$f":"PRRAS!D208","v":0},{"$f":"PRRAS!E208","v":0},0,0,0,0,0]
[151,{"$f":"PRRAS!C209","v":198},{"$f":"PRRAS!D209","v":0},{"$f":"PRRAS!E209","v":0},0,0,0,0,0]
[151,{"$f":"PRRAS!C210","v":199},{"$f":"PRRAS!D210","v":0},{"$f":"PRRAS!E210","v":0},0,0,0,0,0]
[151,{"$f":"PRRAS!C211","v":200},{"$f":"PRRAS!D211","v":0},{"$f":"PRRAS!E211","v":0},0,0,0,0,0]
[151,{"$f":"PRRAS!C212","v":201},{"$f":"PRRAS!D212","v":0},{"$f":"PRRAS!E212","v":0},0,0,0,0,0]
[151,{"$f":"PRRAS!C213","v":202},{"$f":"PRRAS!D213","v":0},{"$f":"PRRAS!E213","v":0},0,0,0,0,0]
[151,{"$f":"PRRAS!C214","v":203},{"$f":"PRRAS!D214","v":0},{"$f":"PRRAS!E214","v":0},0,0,0,0,0]
[151,{"$f":"PRRAS!C215","v":204},{"$f":"PRRAS!D215","v":0},{"$f":"PRRAS!E215","v":0},0,0,0,0,0]
[151,{"$f":"PRRAS!C216","v":205},{"$f":"PRRAS!D216","v":0},{"$f":"PRRAS!E216","v":0},0,0,0,0,0]
[151,{"$f":"PRRAS!C217","v":206},{"$f":"PRRAS!D217","v":0},{"$f":"PRRAS!E217","v":0},0,0,0,0,0]
[151,{"$f":"PRRAS!C218","v":207},{"$f":"PRRAS!D218","v":8312},{"$f":"PRRAS!E218","v":37158},0,0,17103.995999999999,0,0]
[151,{"$f":"PRRAS!C219","v":208},{"$f":"PRRAS!D219","v":8312},{"$f":"PRRAS!E219","v":10483},0,0,6089.8239999999996,0,0]
[151,{"$f":"PRRAS!C220","v":209},{"$f":"PRRAS!D220","v":0},{"$f":"PRRAS!E220","v":0},0,0,0,0,0]
[151,{"$f":"PRRAS!C221","v":210},{"$f":"PRRAS!D221","v":0},{"$f":"PRRAS!E221","v":26675},0,0,11203.5,0,0]
[151,{"$f":"PRRAS!C222","v":211},{"$f":"PRRAS!D222","v":0},{"$f":"PRRAS!E222","v":0},0,0,0,0,0]
[151,{"$f":"PRRAS!C223","v":212},{"$f":"PRRAS!D223","v":0},{"$f":"PRRAS!E223","v":0},0,0,0,0,0]
[151,{"$f":"PRRAS!C224","v":213},{"$f":"PRRAS!D224","v":0},{"$f":"PRRAS!E224","v":0},0,0,0,0,0]
[151,{"$f":"PRRAS!C225","v":214},{"$f":"PRRAS!D225","v":0},{"$f":"PRRAS!E225","v":0},0,0,0,0,0]
[151,{"$f":"PRRAS!C226","v":215},{"$f":"PRRAS!D226","v":0},{"$f":"PRRAS!E226","v":0},0,0,0,0,0]
[151,{"$f":"PRRAS!C227","v":216},{"$f":"PRRAS!D227","v":0},{"$f":"PRRAS!E227","v":0},0,0,0,0,0]
[151,{"$f":"PRRAS!C228","v":217},{"$f":"PRRAS!D228","v":0},{"$f":"PRRAS!E228","v":0},0,0,0,0,0]
[151,{"$f":"PRRAS!C229","v":218},{"$f":"PRRAS!D229","v":0},{"$f":"PRRAS!E229","v":0},0,0,0,0,0]
[151,{"$f":"PRRAS!C230","v":219},{"$f":"PRRAS!D230","v":0},{"$f":"PRRAS!E230","v":0},0,0,0,0,0]
[151,{"$f":"PRRAS!C231","v":220},{"$f":"PRRAS!D231","v":0},{"$f":"PRRAS!E231","v":0},0,0,0,0,0]
[151,{"$f":"PRRAS!C232","v":221},{"$f":"PRRAS!D232","v":0},{"$f":"PRRAS!E232","v":0},0,0,0,0,0]
[151,{"$f":"PRRAS!C233","v":222},{"$f":"PRRAS!D233","v":0},{"$f":"PRRAS!E233","v":0},0,0,0,0,0]
[151,{"$f":"PRRAS!C234","v":223},{"$f":"PRRAS!D234","v":0},{"$f":"PRRAS!E234","v":0},0,0,0,0,0]
[151,{"$f":"PRRAS!C235","v":224},{"$f":"PRRAS!D235","v":0},{"$f":"PRRAS!E235","v":0},0,0,0,0,0]
[151,{"$f":"PRRAS!C236","v":225},{"$f":"PRRAS!D236","v":0},{"$f":"PRRAS!E236","v":0},0,0,0,0,0]
[151,{"$f":"PRRAS!C237","v":226},{"$f":"PRRAS!D237","v":0},{"$f":"PRRAS!E237","v":0},0,0,0,0,0]
[151,{"$f":"PRRAS!C238","v":227},{"$f":"PRRAS!D238","v":0},{"$f":"PRRAS!E238","v":0},0,0,0,0,0]
[151,{"$f":"PRRAS!C239","v":228},{"$f":"PRRAS!D239","v":0},{"$f":"PRRAS!E239","v":0},0,0,0,0,0]
[151,{"$f":"PRRAS!C240","v":229},{"$f":"PRRAS!D240","v":0},{"$f":"PRRAS!E240","v":0},0,0,0,0,0]
[151,{"$f":"PRRAS!C241","v":230},{"$f":"PRRAS!D241","v":0},{"$f":"PRRAS!E241","v":0},0,0,0,0,0]
[151,{"$f":"PRRAS!C242","v":231},{"$f":"PRRAS!D242","v":0},{"$f":"PRRAS!E242","v":0},0,0,0,0,0]
[151,{"$f":"PRRAS!C243","v":232},{"$f":"PRRAS!D243","v":0},{"$f":"PRRAS!E243","v":0},0,0,0,0,0]
[151,{"$f":"PRRAS!C244","v":233},{"$f":"PRRAS!D244","v":0},{"$f":"PRRAS!E244","v":0},0,0,0,0,0]
[151,{"$f":"PRRAS!C245","v":234},{"$f":"PRRAS!D245","v":0},{"$f":"PRRAS!E245","v":0},0,0,0,0,0]
[151,{"$f":"PRRAS!C246","v":235},{"$f":"PRRAS!D246","v":0},{"$f":"PRRAS!E246","v":0},0,0,0,0,0]
[151,{"$f":"PRRAS!C247","v":236},{"$f":"PRRAS!D247","v":0},{"$f":"PRRAS!E247","v":0},0,0,0,0,0]
[151,{"$f":"PRRAS!C248","v":237},{"$f":"PRRAS!D248","v":0},{"$f":"PRRAS!E248","v":0},0,0,0,0,0]
[151,{"$f":"PRRAS!C249","v":238},{"$f":"PRRAS!D249","v":0},{"$f":"PRRAS!E249","v":0},0,0,0,0,0]
[151,{"$f":"PRRAS!C250","v":239},{"$f":"PRRAS!D250","v":0},{"$f":"PRRAS!E250","v":0},0,0,0,0,0]
[151,{"$f":"PRRAS!C251","v":240},{"$f":"PRRAS!D251","v":0},{"$f":"PRRAS!E251","v":0},0,0,0,0,0]
[151,{"$f":"PRRAS!C252","v":241},{"$f":"PRRAS!D252","v":0},{"$f":"PRRAS!E252","v":0},0,0,0,0,0]
[151,{"$f":"PRRAS!C253","v":242},{"$f":"PRRAS!D253","v":0},{"$f":"PRRAS!E253","v":0},0,0,0,0,0]
[151,{"$f":"PRRAS!C254","v":243},{"$f":"PRRAS!D254","v":0},{"$f":"PRRAS!E254","v":0},0,0,0,0,0]
[151,{"$f":"PRRAS!C255","v":244},{"$f":"PRRAS!D255","v":0},{"$f":"PRRAS!E255","v":0},0,0,0,0,0]
[151,{"$f":"PRRAS!C256","v":245},{"$f":"PRRAS!D256","v":0},{"$f":"PRRAS!E256","v":0},0,0,0,0,0]
[151,{"$f":"PRRAS!C257","v":246},{"$f":"PRRAS!D257","v":0},{"$f":"PRRAS!E257","v":0},0,0,0,0,0]
[151,{"$f":"PRRAS!C258","v":247},{"$f":"PRRAS!D258","v":0},{"$f":"PRRAS!E258","v":0},0,0,0,0,0]
[151,{"$f":"PRRAS!C259","v":248},{"$f":"PRRAS!D259","v":0},{"$f":"PRRAS!E259","v":0},0,0,0,0,0]
[151,{"$f":"PRRAS!C260","v":249},{"$f":"PRRAS!D260","v":0},{"$f":"PRRAS!E260","v":0},0,0,0,0,0]
[151,{"$f":"PRRAS!C261","v":250},{"$f":"PRRAS!D261","v":0},{"$f":"PRRAS!E261","v":0},0,0,0,0,0]
[151,{"$f":"PRRAS!C262","v":251},{"$f":"PRRAS!D262","v":0},{"$f":"PRRAS!E262","v":0},0,0,0,0,0]
[151,{"$f":"PRRAS!C263","v":252},{"$f":"PRRAS!D263","v":0},{"$f":"PRRAS!E263","v":0},0,0,0,0,0]
[151,{"$f":"PRRAS!C264","v":253},{"$f":"PRRAS!D264","v":0},{"$f":"PRRAS!E264","v":0},0,0,0,0,0]
[151,{"$f":"PRRAS!C265","v":254},{"$f":"PRRAS!D265","v":0},{"$f":"PRRAS!E265","v":0},0,0,0,0,0]
[151,{"$f":"PRRAS!C266","v":255},{"$f":"PRRAS!D266","v":0},{"$f":"PRRAS!E266","v":0},0,0,0,0,0]
[151,{"$f":"PRRAS!C267","v":256},{"$f":"PRRAS!D267","v":0},{"$f":"PRRAS!E267","v":0},0,0,0,0,0]
[151,{"$f":"PRRAS!C268","v":257},{"$f":"PRRAS!D268","v":0},{"$f":"PRRAS!E268","v":0},0,0,{"$f":"(B258/1000)*(C258*1+D258*2)","v":0},{"$f":"ABS(C258-ROUND(C258,0))+ABS(D258-ROUND(D258,0))","v":0},0]
[151,{"$f":"PRRAS!C269","v":258},{"$f":"PRRAS!D269","v":0},{"$f":"PRRAS!E269","v":0},0,0,0,0,0]
[151,{"$f":"PRRAS!C270","v":259},{"$f":"PRRAS!D270","v":0},{"$f":"PRRAS!E270","v":0},0,0,0,0,0]
[151,{"$f":"PRRAS!C271","v":260},{"$f":"PRRAS!D271","v":0},{"$f":"PRRAS!E271","v":0},0,0,0,0,0]
[151,{"$f":"PRRAS!C272","v":261},{"$f":"PRRAS!D272","v":0},{"$f":"PRRAS!E272","v":0},0,0,0,0,0]
[151,{"$f":"PRRAS!C273","v":262},{"$f":"PRRAS!D273","v":0},{"$f":"PRRAS!E273","v":0},0,0,0,0,0]
[151,{"$f":"PRRAS!C274","v":263},{"$f":"PRRAS!D274","v":0},{"$f":"PRRAS!E274","v":0},0,0,0,0,0]
[151,{"$f":"PRRAS!C275","v":264},{"$f":"PRRAS!D275","v":0},{"$f":"PRRAS!E275","v":0},0,0,0,0,0]
[151,{"$f":"PRRAS!C276","v":265},{"$f":"PRRAS!D276","v":0},{"$f":"PRRAS!E276","v":0},0,0,0,0,0]
[151,{"$f":"PRRAS!C277","v":266},{"$f":"PRRAS!D277","v":0},{"$f":"PRRAS!E277","v":0},0,0,0,0,0]
[151,{"$f":"PRRAS!C278","v":267},{"$f":"PRRAS!D278","v":0},{"$f":"PRRAS!E278","v":0},0,0,0,0,0]
[151,{"$f":"PRRAS!C279","v":268},{"$f":"PRRAS!D279","v":0},{"$f":"PRRAS!E279","v":0},0,0,0,0,0]
[151,{"$f":"PRRAS!C280","v":269},{"$f":"PRRAS!D280","v":0},{"$f":"PRRAS!E280","v":0},0,0,0,0,0]
[151,{"$f":"PRRAS!C281","v":270},{"$f":"PRRAS!D281","v":0},{"$f":"PRRAS!E281","v":0},0,0,0,0,0]
[151,{"$f":"PRRAS!C282","v":271},{"$f":"PRRAS!D282","v":0},{"$f":"PRRAS!E282","v":0},0,0,0,0,0]
[151,{"$f":"PRRAS!C283","v":272},{"$f":"PRRAS!D283","v":0},{"$f":"PRRAS!E283","v":0},0,0,0,0,0]
[151,{"$f":"PRRAS!C284","v":273},{"$f":"PRRAS!D284","v":0},{"$f":"PRRAS!E284","v":0},0,0,0,0,0]
[151,{"$f":"PRRAS!C285","v":274},{"$f":"PRRAS!D285","v":0},{"$f":"PRRAS!E285","v":0},0,0,0,0,0]
[151,{"$f":"PRRAS!C286","v":275},{"$f":"PRRAS!D286","v":0},{"$f":"PRRAS!E286","v":0},0,0,0,0,0]
[151,{"$f":"PRRAS!C287","v":276},{"$f":"PRRAS!D287","v":0},{"$f":"PRRAS!E287","v":0},0,0,0,0,0]
[151,{"$f":"PRRAS!C288","v":277},{"$f":"PRRAS!D288","v":0},{"$f":"PRRAS!E288","v":0},0,0,0,0,0]
[151,{"$f":"PRRAS!C289","v":278},{"$f":"PRRAS!D289","v":0},{"$f":"PRRAS!E289","v":0},0,0,0,0,0]
[151,{"$f":"PRRAS!C290","v":279},{"$f":"PRRAS!D290","v":0},{"$f":"PRRAS!E290","v":0},0,0,0,0,0]
[151,{"$f":"PRRAS!C291","v":280},{"$f":"PRRAS!D291","v":0},{"$f":"PRRAS!E291","v":0},0,0,0,0,0]
[151,{"$f":"PRRAS!C292","v":281},{"$f":"PRRAS!D292","v":7344045},{"$f":"PRRAS!E292","v":7840643},0,0,6470118.0110000009,0,0]
[151,{"$f":"PRRAS!C293","v":282},{"$f":"PRRAS!D293","v":33540},{"$f":"PRRAS!E293","v":0},0,0,9458.2799999999988,0,0]
[151,{"$f":"PRRAS!C294","v":283},{"$f":"PRRAS!D294","v":0},{"$f":"PRRAS!E294","v":19429},0,0,10996.813999999998,0,0]
[151,{"$f":"PRRAS!C295","v":284},{"$f":"PRRAS!D295","v":66867},{"$f":"PRRAS!E295","v":85944},0,0,67806.42,0,0]
[151,{"$f":"PRRAS!C296","v":285},{"$f":"PRRAS!D296","v":0},{"$f":"PRRAS!E296","v":0},0,0,0,0,0]
[151,{"$f":"PRRAS!C297","v":286},{"$f":"PRRAS!D297","v":7258},{"$f":"PRRAS!E297","v":8943},0,0,7191.1839999999993,0,0]
[151,{"$f":"PRRAS!C298","v":287},{"$f":"PRRAS!D298","v":7258},{"$f":"PRRAS!E298","v":8943},0,0,7216.3279999999995,0,0]
[151,{"$f":"PRRAS!C299","v":288},{"$f":"PRRAS!D299","v":0},{"$f":"PRRAS!E299","v":0},0,0,0,0,0]
[151,{"$f":"PRRAS!C301","v":289},{"$f":"PRRAS!D301","v":0},{"$f":"PRRAS!E301","v":0},0,0,0,0,0]
[151,{"$f":"PRRAS!C302","v":290},{"$f":"PRRAS!D302","v":0},{"$f":"PRRAS!E302","v":0},0,0,0,0,0]
[151,{"$f":"PRRAS!C303","v":291},{"$f":"PRRAS!D303","v":0},{"$f":"PRRAS!E303","v":0},0,0,0,0,0]
[151,{"$f":"PRRAS!C304","v":292},{"$f":"PRRAS!D304","v":0},{"$f":"PRRAS!E304","v":0},0,0,0,0,0]
[151,{"$f":"PRRAS!C305","v":293},{"$f":"PRRAS!D305","v":0},{"$f":"PRRAS!E305","v":0},0,0,0,0,0]
[151,{"$f":"PRRAS!C306","v":294},{"$f":"PRRAS!D306","v":0},{"$f":"PRRAS!E306","v":0},0,0,0,0,0]
[151,{"$f":"PRRAS!C307","v":295},{"$f":"PRRAS!D307","v":0},{"$f":"PRRAS!E307","v":0},0,0,0,0,0]
[151,{"$f":"PRRAS!C308","v":296},{"$f":"PRRAS!D308","v":0},{"$f":"PRRAS!E308","v":0},0,0,0,0,0]
[151,{"$f":"PRRAS!C309","v":297},{"$f":"PRRAS!D309","v":0},{"$f":"PRRAS!E309","v":0},0,0,0,0,0]
[151,{"$f":"PRRAS!C310","v":298},{"$f":"PRRAS!D310","v":0},{"$f":"PRRAS!E310","v":0},0,0,0,0,0]
[151,{"$f":"PRRAS!C311","v":299},{"$f":"PRRAS!D311","v":0},{"$f":"PRRAS!E311","v":0},0,0,0,0,0]
[151,{"$f":"PRRAS!C312","v":300},{"$f":"PRRAS!D312","v":0},{"$f":"PRRAS!E312","v":0},0,0,0,0,0]
[151,{"$f":"PRRAS!C313","v":301},{"$f":"PRRAS!D313","v":0},{"$f":"PRRAS!E313","v":0},0,0,0,0,0]
[151,{"$f":"PRRAS!C314","v":302},{"$f":"PRRAS!D314","v":0},{"$f":"PRRAS!E314","v":0},0,0,0,0,0]
[151,{"$f":"PRRAS!C315","v":303},{"$f":"PRRAS!D315","v":0},{"$f":"PRRAS!E315","v":0},0,0,0,0,0]
[151,{"$f":"PRRAS!C316","v":304},{"$f":"PRRAS!D316","v":0},{"$f":"PRRAS!E316","v":0},0,0,0,0,0]
[151,{"$f":"PRRAS!C317","v":305},{"$f":"PRRAS!D317","v":0},{"$f":"PRRAS!E317","v":0},0,0,0,0,0]
[151,{"$f":"PRRAS!C318","v":306},{"$f":"PRRAS!D318","v":0},{"$f":"PRRAS!E318","v":0},0,0,0,0,0]
[151,{"$f":"PRRAS!C319","v":307},{"$f":"PRRAS!D319","v":0},{"$f":"PRRAS!E319","v":0},0,0,0,0,0]
[151,{"$f":"PRRAS!C320","v":308},{"$f":"PRRAS!D320","v":0},{"$f":"PRRAS!E320","v":0},0,0,0,0,0]
[151,{"$f":"PRRAS!C321","v":309},{"$f":"PRRAS!D321","v":0},{"$f":"PRRAS!E321","v":0},0,0,0,0,0]
[151,{"$f":"PRRAS!C322","v":310},{"$f":"PRRAS!D322","v":0},{"$f":"PRRAS!E322","v":0},0,0,0,0,0]
[151,{"$f":"PRRAS!C323","v":311},{"$f":"PRRAS!D323","v":0},{"$f":"PRRAS!E323","v":0},0,0,0,0,0]
[151,{"$f":"PRRAS!C324","v":312},{"$f":"PRRAS!D324","v":0},{"$f":"PRRAS!E324","v":0},0,0,0,0,0]
[151,{"$f":"PRRAS!C325","v":313},{"$f":"PRRAS!D325","v":0},{"$f":"PRRAS!E325","v":0},0,0,0,0,0]
[151,{"$f":"PRRAS!C326","v":314},{"$f":"PRRAS!D326","v":0},{"$f":"PRRAS!E326","v":0},0,0,0,0,0]
[151,{"$f":"PRRAS!C327","v":315},{"$f":"PRRAS!D327","v":0},{"$f":"PRRAS!E327","v":0},0,0,0,0,0]
[151,{"$f":"PRRAS!C328","v":316},{"$f":"PRRAS!D328","v":0},{"$f":"PRRAS!E328","v":0},0,0,0,0,0]
[151,{"$f":"PRRAS!C329","v":317},{"$f":"PRRAS!D329","v":0},{"$f":"PRRAS!E329","v":0},0,0,0,0,0]
[151,{"$f":"PRRAS!C330","v":318},{"$f":"PRRAS!D330","v":0},{"$f":"PRRAS!E330","v":0},0,0,0,0,0]
[151,{"$f":"PRRAS!C331","v":319},{"$f":"PRRAS!D331","v":0},{"$f":"PRRAS!E331","v":0},0,0,0,0,0]
[151,{"$f":"PRRAS!C332","v":320},{"$f":"PRRAS!D332","v":0},{"$f":"PRRAS!E332","v":0},0,0,0,0,0]
[151,{"$f":"PRRAS!C333","v":321},{"$f":"PRRAS!D333","v":0},{"$f":"PRRAS!E333","v":0},0,0,{"$f":"(B322/1000)*(C322*1+D322*2)","v":0},{"$f":"ABS(C322-ROUND(C322,0))+ABS(D322-ROUND(D322,0))","v":0},0]
[151,{"$f":"PRRAS!C334","v":322},{"$f":"PRRAS!D334","v":0},{"$f":"PRRAS!E334","v":0},0,0,0,0,0]
[151,{"$f":"PRRAS!C335","v":323},{"$f":"PRRAS!D335","v":0},{"$f":"PRRAS!E335","v":0},0,0,0,0,0]
[151,{"$f":"PRRAS!C336","v":324},{"$f":"PRRAS!D336","v":0},{"$f":"PRRAS!E336","v":0},0,0,0,0,0]
[151,{"$f":"PRRAS!C337","v":325},{"$f":"PRRAS!D337","v":0},{"$f":"PRRAS!E337","v":0},0,0,0,0,0]
[151,{"$f":"PRRAS!C338","v":326},{"$f":"PRRAS!D338","v":0},{"$f":"PRRAS!E338","v":0},0,0,0,0,0]
[151,{"$f":"PRRAS!C339","v":327},{"$f":"PRRAS!D339","v":0},{"$f":"PRRAS!E339","v":0},0,0,0,0,0]
[151,{"$f":"PRRAS!C340","v":328},{"$f":"PRRAS!D340","v":0},{"$f":"PRRAS!E340","v":0},0,0,0,0,0]
[151,{"$f":"PRRAS!C341","v":329},{"$f":"PRRAS!D341","v":0},{"$f":"PRRAS!E341","v":0},0,0,0,0,0]
[151,{"$f":"PRRAS!C342","v":330},{"$f":"PRRAS!D342","v":0},{"$f":"PRRAS!E342","v":0},0,0,0,0,0]
[151,{"$f":"PRRAS!C343","v":331},{"$f":"PRRAS!D343","v":0},{"$f":"PRRAS!E343","v":0},0,0,0,0,0]
[151,{"$f":"PRRAS!C344","v":332},{"$f":"PRRAS!D344","v":0},{"$f":"PRRAS!E344","v":0},0,0,0,0,0]
[151,{"$f":"PRRAS!C345","v":333},{"$f":"PRRAS!D345","v":0},{"$f":"PRRAS!E345","v":0},0,0,0,0,0]
[151,{"$f":"PRRAS!C346","v":334},{"$f":"PRRAS!D346","v":0},{"$f":"PRRAS!E346","v":0},0,0,0,0,0]
[151,{"$f":"PRRAS!C347","v":335},{"$f":"PRRAS!D347","v":0},{"$f":"PRRAS!E347","v":0},0,0,0,0,0]
[151,{"$f":"PRRAS!C348","v":336},{"$f":"PRRAS!D348","v":0},{"$f":"PRRAS!E348","v":0},0,0,0,0,0]
[151,{"$f":"PRRAS!C349","v":337},{"$f":"PRRAS!D349","v":0},{"$f":"PRRAS!E349","v":0},0,0,0,0,0]
[151,{"$f":"PRRAS!C350","v":338},{"$f":"PRRAS!D350","v":0},{"$f":"PRRAS!E350","v":0},0,0,0,0,0]
[151,{"$f":"PRRAS!C351","v":339},{"$f":"PRRAS!D351","v":0},{"$f":"PRRAS!E351","v":0},0,0,0,0,0]
[151,{"$f":"PRRAS!C352","v":340},{"$f":"PRRAS!D352","v":0},{"$f":"PRRAS!E352","v":0},0,0,0,0,0]
[151,{"$f":"PRRAS!C353","v":341},{"$f":"PRRAS!D353","v":14462},{"$f":"PRRAS!E353","v":53965},0,0,41735.672000000006,0,0]
[151,{"$f":"PRRAS!C354","v":342},{"$f":"PRRAS!D354","v":0},{"$f":"PRRAS!E354","v":0},0,0,0,0,0]
[151,{"$f":"PRRAS!C355","v":343},{"$f":"PRRAS!D355","v":0},{"$f":"PRRAS!E355","v":0},0,0,0,0,0]
[151,{"$f":"PRRAS!C356","v":344},{"$f":"PRRAS!D356","v":0},{"$f":"PRRAS!E356","v":0},0,0,0,0,0]
[151,{"$f":"PRRAS!C357","v":345},{"$f":"PRRAS!D357","v":0},{"$f":"PRRAS!E357","v":0},0,0,0,0,0]
[151,{"$f":"PRRAS!C358","v":346},{"$f":"PRRAS!D358","v":0},{"$f":"PRRAS!E358","v":0},0,0,0,0,0]
[151,{"$f":"PRRAS!C359","v":347},{"$f":"PRRAS!D359","v":0},{"$f":"PRRAS!E359","v":0},0,0,0,0,0]
[151,{"$f":"PRRAS!C360","v":348},{"$f":"PRRAS!D360","v":0},{"$f":"PRRAS!E360","v":0},0,0,0,0,0]
[151,{"$f":"PRRAS!C361","v":349},{"$f":"PRRAS!D361","v":0},{"$f":"PRRAS!E361","v":0},0,0,0,0,0]
[151,{"$f":"PRRAS!C362","v":350},{"$f":"PRRAS!D362","v":0},{"$f":"PRRAS!E362","v":0},0,0,0,0,0]
[151,{"$f":"PRRAS!C363","v":351},{"$f":"PRRAS!D363","v":0},{"$f":"PRRAS!E363","v":0},0,0,0,0,0]
[151,{"$f":"PRRAS!C364","v":352},{"$f":"PRRAS!D364","v":0},{"$f":"PRRAS!E364","v":0},0,0,0,0,0]
[151,{"$f":"PRRAS!C365","v":353},{"$f":"PRRAS!D365","v":0},{"$f":"PRRAS!E365","v":0},0,0,0,0,0]
[151,{"$f":"PRRAS!C366","v":354},{"$f":"PRRAS!D366","v":14462},{"$f":"PRRAS!E366","v":53965},0,0,43326.767999999996,0,0]
[151,{"$f":"PRRAS!C367","v":355},{"$f":"PRRAS!D367","v":0},{"$f":"PRRAS!E367","v":0},0,0,0,0,0]
[151,{"$f":"PRRAS!C368","v":356},{"$f":"PRRAS!D368","v":0},{"$f":"PRRAS!E368","v":0},0,0,0,0,0]
[151,{"$f":"PRRAS!C369","v":357},{"$f":"PRRAS!D369","v":0},{"$f":"PRRAS!E369","v":0},0,0,0,0,0]
[151,{"$f":"PRRAS!C370","v":358},{"$f":"PRRAS!D370","v":0},{"$f":"PRRAS!E370","v":0},0,0,0,0,0]
[151,{"$f":"PRRAS!C371","v":359},{"$f":"PRRAS!D371","v":0},{"$f":"PRRAS!E371","v":0},0,0,0,0,0]
[151,{"$f":"PRRAS!C372","v":360},{"$f":"PRRAS!D372","v":14142},{"$f":"PRRAS!E372","v":53965},0,0,43945.919999999998,0,0]
[151,{"$f":"PRRAS!C373","v":361},{"$f":"PRRAS!D373","v":8692},{"$f":"PRRAS!E373","v":27375},0,0,22902.561999999998,0,0]
[151,{"$f":"PRRAS!C374","v":362},{"$f":"PRRAS!D374","v":0},{"$f":"PRRAS!E374","v":0},0,0,0,0,0]
[151,{"$f":"PRRAS!C375","v":363},{"$f":"PRRAS!D375","v":0},{"$f":"PRRAS!E375","v":16464},0,0,11952.864,0,0]
[151,{"$f":"PRRAS!C376","v":364},{"$f":"PRRAS!D376","v":0},{"$f":"PRRAS!E376","v":0},0,0,0,0,0]
[151,{"$f":"PRRAS!C377","v":365},{"$f":"PRRAS!D377","v":0},{"$f":"PRRAS!E377","v":0},0,0,0,0,0]
[151,{"$f":"PRRAS!C378","v":366},{"$f":"PRRAS!D378","v":0},{"$f":"PRRAS!E378","v":3390},0,0,2481.48,0,0]
[151,{"$f":"PRRAS!C379","v":367},{"$f":"PRRAS!D379","v":5450},{"$f":"PRRAS!E379","v":6736},0,0,6944.3739999999998,0,0]
[151,{"$f":"PRRAS!C380","v":368},{"$f":"PRRAS!D380","v":0},{"$f":"PRRAS!E380","v":0},0,0,0,0,0]
[151,{"$f":"PRRAS!C381","v":369},{"$f":"PRRAS!D381","v":0},{"$f":"PRRAS!E381","v":0},0,0,0,0,0]
[151,{"$f":"PRRAS!C382","v":370},{"$f":"PRRAS!D382","v":0},{"$f":"PRRAS!E382","v":0},0,0,0,0,0]
[151,{"$f":"PRRAS!C383","v":371},{"$f":"PRRAS!D383","v":0},{"$f":"PRRAS!E383","v":0},0,0,0,0,0]
[151,{"$f":"PRRAS!C384","v":372},{"$f":"PRRAS!D384","v":0},{"$f":"PRRAS!E384","v":0},0,0,0,0,0]
[151,{"$f":"PRRAS!C385","v":373},{"$f":"PRRAS!D385","v":0},{"$f":"PRRAS!E385","v":0},0,0,0,0,0]
[151,{"$f":"PRRAS!C386","v":374},{"$f":"PRRAS!D386","v":320},{"$f":"PRRAS!E386","v":0},0,0,119.68,0,0]
[151,{"$f":"PRRAS!C387","v":375},{"$f":"PRRAS!D387","v":320},{"$f":"PRRAS!E387","v":0},0,0,120,0,0]
[151,{"$f":"PRRAS!C388","v":376},{"$f":"PRRAS!D388","v":0},{"$f":"PRRAS!E388","v":0},0,0,0,0,0]
[151,{"$f":"PRRAS!C389","v":377},{"$f":"PRRAS!D389","v":0},{"$f":"PRRAS!E389","v":0},0,0,0,0,0]
[151,{"$f":"PRRAS!C390","v":378},{"$f":"PRRAS!D390","v":0},{"$f":"PRRAS!E390","v":0},0,0,0,0,0]
[151,{"$f":"PRRAS!C391","v":379},{"$f":"PRRAS!D391","v":0},{"$f":"PRRAS!E391","v":0},0,0,0,0,0]
[151,{"$f":"PRRAS!C392","v":380},{"$f":"PRRAS!D392","v":0},{"$f":"PRRAS!E392","v":0},0,0,0,0,0]
[151,{"$f":"PRRAS!C393","v":381},{"$f":"PRRAS!D393","v":0},{"$f":"PRRAS!E393","v":0},0,0,0,0,0]
[151,{"$f":"PRRAS!C394","v":382},{"$f":"PRRAS!D394","v":0},{"$f":"PRRAS!E394","v":0},0,0,0,0,0]
[151,{"$f":"PRRAS!C395","v":383},{"$f":"PRRAS!D395","v":0},{"$f":"PRRAS!E395","v":0},0,0,0,0,0]
[151,{"$f":"PRRAS!C396","v":384},{"$f":"PRRAS!D396","v":0},{"$f":"PRRAS!E396","v":0},0,0,0,0,0]
[151,{"$f":"PRRAS!C397","v":385},{"$f":"PRRAS!D397","v":0},{"$f":"PRRAS!E397","v":0},0,0,{"$f":"(B386/1000)*(C386*1+D386*2)","v":0},{"$f":"ABS(C386-ROUND(C386,0))+ABS(D386-ROUND(D386,0))","v":0},0]
[151,{"$f":"PRRAS!C398","v":386},{"$f":"PRRAS!D398","v":0},{"$f":"PRRAS!E398","v":0},0,0,0,0,0]
[151,{"$f":"PRRAS!C399","v":387},{"$f":"PRRAS!D399","v":0},{"$f":"PRRAS!E399","v":0},0,0,0,0,0]
[151,{"$f":"PRRAS!C400","v":388},{"$f":"PRRAS!D400","v":0},{"$f":"PRRAS!E400","v":0},0,0,0,0,0]
[151,{"$f":"PRRAS!C401","v":389},{"$f":"PRRAS!D401","v":0},{"$f":"PRRAS!E401","v":0},0,0,0,0,0]
[151,{"$f":"PRRAS!C402","v":390},{"$f":"PRRAS!D402","v":0},{"$f":"PRRAS!E402","v":0},0,0,0,0,0]
[151,{"$f":"PRRAS!C403","v":391},{"$f":"PRRAS!D403","v":0},{"$f":"PRRAS!E403","v":0},0,0,0,0,0]
[151,{"$f":"PRRAS!C404","v":392},{"$f":"PRRAS!D404","v":0},{"$f":"PRRAS!E404","v":0},0,0,0,0,0]
[151,{"$f":"PRRAS!C405","v":393},{"$f":"PRRAS!D405","v":0},{"$f":"PRRAS!E405","v":0},0,0,0,0,0]
[151,{"$f":"PRRAS!C406","v":394},{"$f":"PRRAS!D406","v":0},{"$f":"PRRAS!E406","v":0},0,0,0,0,0]
[151,{"$f":"PRRAS!C407","v":395},{"$f":"PRRAS!D407","v":0},{"$f":"PRRAS!E407","v":0},0,0,0,0,0]
[151,{"$f":"PRRAS!C408","v":396},{"$f":"PRRAS!D408","v":0},{"$f":"PRRAS!E408","v":0},0,0,0,0,0]
[151,{"$f":"PRRAS!C409","v":397},{"$f":"PRRAS!D409","v":0},{"$f":"PRRAS!E409","v":0},0,0,0,0,0]
[151,{"$f":"PRRAS!C410","v":398},{"$f":"PRRAS!D410","v":0},{"$f":"PRRAS!E410","v":0},0,0,0,0,0]
[151,{"$f":"PRRAS!C411","v":399},{"$f":"PRRAS!D411","v":14462},{"$f":"PRRAS!E411","v":53965},0,0,48834.408000000003,0,0]
[151,{"$f":"PRRAS!C412","v":400},{"$f":"PRRAS!D412","v":0},{"$f":"PRRAS!E412","v":0},0,0,0,0,0]
[151,{"$f":"PRRAS!C413","v":401},{"$f":"PRRAS!D413","v":0},{"$f":"PRRAS!E413","v":0},0,0,0,0,0]
[151,{"$f":"PRRAS!C414","v":402},{"$f":"PRRAS!D414","v":0},{"$f":"PRRAS!E414","v":0},0,0,0,0,0]
[151,{"$f":"PRRAS!C415","v":403},{"$f":"PRRAS!D415","v":7377585},{"$f":"PRRAS!E415","v":7821214},0,0,9277065.2390000001,0,0]
[151,{"$f":"PRRAS!C416","v":404},{"$f":"PRRAS!D416","v":7358507},{"$f":"PRRAS!E416","v":7894608},0,0,9351680.0920000002,0,0]
[151,{"$f":"PRRAS!C417","v":405},{"$f":"PRRAS!D417","v":19078},{"$f":"PRRAS!E417","v":0},0,0,7726.59,0,0]
[151,{"$f":"PRRAS!C418","v":406},{"$f":"PRRAS!D418","v":0},{"$f":"PRRAS!E418","v":73394},0,0,59595.928000000007,0,0]
[151,{"$f":"PRRAS!C419","v":407},{"$f":"PRRAS!D419","v":66867},{"$f":"PRRAS!E419","v":85944},0,0,97173.284999999989,0,0]
[151,{"$f":"PRRAS!C420","v":408},{"$f":"PRRAS!D420","v":0},{"$f":"PRRAS!E420","v":0},0,0,0,0,0]
[151,{"$f":"PRRAS!C421","v":409},{"$f":"PRRAS!D421","v":7258},{"$f":"PRRAS!E421","v":8943},0,0,10283.895999999999,0,0]
[151,{"$f":"PRRAS!C423","v":410},{"$f":"PRRAS!D423","v":0},{"$f":"PRRAS!E423","v":0},0,0,0,0,0]
[151,{"$f":"PRRAS!C424","v":411},{"$f":"PRRAS!D424","v":0},{"$f":"PRRAS!E424","v":0},0,0,0,0,0]
[151,{"$f":"PRRAS!C425","v":412},{"$f":"PRRAS!D425","v":0},{"$f":"PRRAS!E425","v":0},0,0,0,0,0]
[151,{"$f":"PRRAS!C426","v":413},{"$f":"PRRAS!D426","v":0},{"$f":"PRRAS!E426","v":0},0,0,0,0,0]
[151,{"$f":"PRRAS!C427","v":414},{"$f":"PRRAS!D427","v":0},{"$f":"PRRAS!E427","v":0},0,0,0,0,0]
[151,{"$f":"PRRAS!C428","v":415},{"$f":"PRRAS!D428","v":0},{"$f":"PRRAS!E428","v":0},0,0,0,0,0]
[151,{"$f":"PRRAS!C429","v":416},{"$f":"PRRAS!D429","v":0},{"$f":"PRRAS!E429","v":0},0,0,0,0,0]
[151,{"$f":"PRRAS!C430","v":417},{"$f":"PRRAS!D430","v":0},{"$f":"PRRAS!E430","v":0},0,0,0,0,0]
[151,{"$f":"PRRAS!C431","v":418},{"$f":"PRRAS!D431","v":0},{"$f":"PRRAS!E431","v":0},0,0,0,0,0]
[151,{"$f":"PRRAS!C432","v":419},{"$f":"PRRAS!D432","v":0},{"$f":"PRRAS!E432","v":0},0,0,0,0,0]
[151,{"$f":"PRRAS!C433","v":420},{"$f":"PRRAS!D433","v":0},{"$f":"PRRAS!E433","v":0},0,0,0,0,0]
[151,{"$f":"PRRAS!C434","v":421},{"$f":"PRRAS!D434","v":0},{"$f":"PRRAS!E434","v":0},0,0,0,0,0]
[151,{"$f":"PRRAS!C435","v":422},{"$f":"PRRAS!D435","v":0},{"$f":"PRRAS!E435","v":0},0,0,0,0,0]
[151,{"$f":"PRRAS!C436","v":423},{"$f":"PRRAS!D436","v":0},{"$f":"PRRAS!E436","v":0},0,0,0,0,0]
[151,{"$f":"PRRAS!C437","v":424},{"$f":"PRRAS!D437","v":0},{"$f":"PRRAS!E437","v":0},0,0,0,0,0]
[151,{"$f":"PRRAS!C438","v":425},{"$f":"PRRAS!D438","v":0},{"$f":"PRRAS!E438","v":0},0,0,0,0,0]
[151,{"$f":"PRRAS!C439","v":426},{"$f":"PRRAS!D439","v":0},{"$f":"PRRAS!E439","v":0},0,0,0,0,0]
[151,{"$f":"PRRAS!C440","v":427},{"$f":"PRRAS!D440","v":0},{"$f":"PRRAS!E440","v":0},0,0,0,0,0]
[151,{"$f":"PRRAS!C441","v":428},{"$f":"PRRAS!D441","v":0},{"$f":"PRRAS!E441","v":0},0,0,0,0,0]
[151,{"$f":"PRRAS!C442","v":429},{"$f":"PRRAS!D442","v":0},{"$f":"PRRAS!E442","v":0},0,0,0,0,0]
[151,{"$f":"PRRAS!C443","v":430},{"$f":"PRRAS!D443","v":0},{"$f":"PRRAS!E443","v":0},0,0,0,0,0]
[151,{"$f":"PRRAS!C444","v":431},{"$f":"PRRAS!D444","v":0},{"$f":"PRRAS!E444","v":0},0,0,0,0,0]
[151,{"$f":"PRRAS!C445","v":432},{"$f":"PRRAS!D445","v":0},{"$f":"PRRAS!E445","v":0},0,0,0,0,0]
[151,{"$f":"PRRAS!C446","v":433},{"$f":"PRRAS!D446","v":0},{"$f":"PRRAS!E446","v":0},0,0,0,0,0]
[151,{"$f":"PRRAS!C447","v":434},{"$f":"PRRAS!D447","v":0},{"$f":"PRRAS!E447","v":0},0,0,0,0,0]
[151,{"$f":"PRRAS!C448","v":435},{"$f":"PRRAS!D448","v":0},{"$f":"PRRAS!E448","v":0},0,0,0,0,0]
[151,{"$f":"PRRAS!C449","v":436},{"$f":"PRRAS!D449","v":0},{"$f":"PRRAS!E449","v":0},0,0,0,0,0]
[151,{"$f":"PRRAS!C450","v":437},{"$f":"PRRAS!D450","v":0},{"$f":"PRRAS!E450","v":0},0,0,0,0,0]
[151,{"$f":"PRRAS!C451","v":438},{"$f":"PRRAS!D451","v":0},{"$f":"PRRAS!E451","v":0},0,0,0,0,0]
[151,{"$f":"PRRAS!C452","v":439},{"$f":"PRRAS!D452","v":0},{"$f":"PRRAS!E452","v":0},0,0,0,0,0]
[151,{"$f":"PRRAS!C453","v":440},{"$f":"PRRAS!D453","v":0},{"$f":"PRRAS!E453","v":0},0,0,0,0,0]
[151,{"$f":"PRRAS!C454","v":441},{"$f":"PRRAS!D454","v":0},{"$f":"PRRAS!E454","v":0},0,0,0,0,0]
[151,{"$f":"PRRAS!C455","v":442},{"$f":"PRRAS!D455","v":0},{"$f":"PRRAS!E455","v":0},0,0,0,0,0]
[151,{"$f":"PRRAS!C456","v":443},{"$f":"PRRAS!D456","v":0},{"$f":"PRRAS!E456","v":0},0,0,0,0,0]
[151,{"$f":"PRRAS!C457","v":444},{"$f":"PRRAS!D457","v":0},{"$f":"PRRAS!E457","v":0},0,0,0,0,0]
[151,{"$f":"PRRAS!C458","v":445},{"$f":"PRRAS!D458","v":0},{"$f":"PRRAS!E458","v":0},0,0,0,0,0]
[151,{"$f":"PRRAS!C459","v":446},{"$f":"PRRAS!D459","v":0},{"$f":"PRRAS!E459","v":0},0,0,0,0,0]
[151,{"$f":"PRRAS!C460","v":447},{"$f":"PRRAS!D460","v":0},{"$f":"PRRAS!E460","v":0},0,0,0,0,0]
[151,{"$f":"PRRAS!C461","v":448},{"$f":"PRRAS!D461","v":0},{"$f":"PRRAS!E461","v":0},0,0,0,0,0]
[151,{"$f":"PRRAS!C462","v":449},{"$f":"PRRAS!D462","v":0},{"$f":"PRRAS!E462","v":0},0,0,{"$f":"(B450/1000)*(C450*1+D450*2)","v":0},{"$f":"ABS(C450-ROUND(C450,0))+ABS(D450-ROUND(D450,0))","v":0},0]
[151,{"$f":"PRRAS!C463","v":450},{"$f":"PRRAS!D463","v":0},{"$f":"PRRAS!E463","v":0},0,0,0,0,0]
[151,{"$f":"PRRAS!C464","v":451},{"$f":"PRRAS!D464","v":0},{"$f":"PRRAS!E464","v":0},0,0,0,0,0]
[151,{"$f":"PRRAS!C465","v":452},{"$f":"PRRAS!D465","v":0},{"$f":"PRRAS!E465","v":0},0,0,0,0,0]
[151,{"$f":"PRRAS!C466","v":453},{"$f":"PRRAS!D466","v":0},{"$f":"PRRAS!E466","v":0},0,0,0,0,0]
[151,{"$f":"PRRAS!C467","v":454},{"$f":"PRRAS!D467","v":0},{"$f":"PRRAS!E467","v":0},0,0,0,0,0]
[151,{"$f":"PRRAS!C468","v":455},{"$f":"PRRAS!D468","v":0},{"$f":"PRRAS!E468","v":0},0,0,0,0,0]
[151,{"$f":"PRRAS!C469","v":456},{"$f":"PRRAS!D469","v":0},{"$f":"PRRAS!E469","v":0},0,0,0,0,0]
[151,{"$f":"PRRAS!C470","v":457},{"$f":"PRRAS!D470","v":0},{"$f":"PRRAS!E470","v":0},0,0,0,0,0]
[151,{"$f":"PRRAS!C471","v":458},{"$f":"PRRAS!D471","v":0},{"$f":"PRRAS!E471","v":0},0,0,0,0,0]
[151,{"$f":"PRRAS!C472","v":459},{"$f":"PRRAS!D472","v":0},{"$f":"PRRAS!E472","v":0},0,0,0,0,0]
[151,{"$f":"PRRAS!C473","v":460},{"$f":"PRRAS!D473","v":0},{"$f":"PRRAS!E473","v":0},0,0,0,0,0]
[151,{"$f":"PRRAS!C474","v":461},{"$f":"PRRAS!D474","v":0},{"$f":"PRRAS!E474","v":0},0,0,0,0,0]
[151,{"$f":"PRRAS!C475","v":462},{"$f":"PRRAS!D475","v":0},{"$f":"PRRAS!E475","v":0},0,0,0,0,0]
[151,{"$f":"PRRAS!C476","v":463},{"$f":"PRRAS!D476","v":0},{"$f":"PRRAS!E476","v":0},0,0,0,0,0]
[151,{"$f":"PRRAS!C477","v":464},{"$f":"PRRAS!D477","v":0},{"$f":"PRRAS!E477","v":0},0,0,0,0,0]
[151,{"$f":"PRRAS!C478","v":465},{"$f":"PRRAS!D478","v":0},{"$f":"PRRAS!E478","v":0},0,0,0,0,0]
[151,{"$f":"PRRAS!C479","v":466},{"$f":"PRRAS!D479","v":0},{"$f":"PRRAS!E479","v":0},0,0,0,0,0]
[151,{"$f":"PRRAS!C480","v":467},{"$f":"PRRAS!D480","v":0},{"$f":"PRRAS!E480","v":0},0,0,0,0,0]
[151,{"$f":"PRRAS!C481","v":468},{"$f":"PRRAS!D481","v":0},{"$f":"PRRAS!E481","v":0},0,0,0,0,0]
[151,{"$f":"PRRAS!C482","v":469},{"$f":"PRRAS!D482","v":0},{"$f":"PRRAS!E482","v":0},0,0,0,0,0]
[151,{"$f":"PRRAS!C483","v":470},{"$f":"PRRAS!D483","v":0},{"$f":"PRRAS!E483","v":0},0,0,0,0,0]
[151,{"$f":"PRRAS!C484","v":471},{"$f":"PRRAS!D484","v":0},{"$f":"PRRAS!E484","v":0},0,0,0,0,0]
[151,{"$f":"PRRAS!C485","v":472},{"$f":"PRRAS!D485","v":0},{"$f":"PRRAS!E485","v":0},0,0,0,0,0]
[151,{"$f":"PRRAS!C486","v":473},{"$f":"PRRAS!D486","v":0},{"$f":"PRRAS!E486","v":0},0,0,0,0,0]
[151,{"$f":"PRRAS!C487","v":474},{"$f":"PRRAS!D487","v":0},{"$f":"PRRAS!E487","v":0},0,0,0,0,0]
[151,{"$f":"PRRAS!C488","v":475},{"$f":"PRRAS!D488","v":0},{"$f":"PRRAS!E488","v":0},0,0,0,0,0]
[151,{"$f":"PRRAS!C489","v":476},{"$f":"PRRAS!D489","v":0},{"$f":"PRRAS!E489","v":0},0,0,0,0,0]
[151,{"$f":"PRRAS!C490","v":477},{"$f":"PRRAS!D490","v":0},{"$f":"PRRAS!E490","v":0},0,0,0,0,0]
[151,{"$f":"PRRAS!C491","v":478},{"$f":"PRRAS!D491","v":0},{"$f":"PRRAS!E491","v":0},0,0,0,0,0]
[151,{"$f":"PRRAS!C492","v":479},{"$f":"PRRAS!D492","v":0},{"$f":"PRRAS!E492","v":0},0,0,0,0,0]
[151,{"$f":"PRRAS!C493","v":480},{"$f":"PRRAS!D493","v":0},{"$f":"PRRAS!E493","v":0},0,0,0,0,0]
[151,{"$f":"PRRAS!C494","v":481},{"$f":"PRRAS!D494","v":0},{"$f":"PRRAS!E494","v":0},0,0,0,0,0]
[151,{"$f":"PRRAS!C495","v":482},{"$f":"PRRAS!D495","v":0},{"$f":"PRRAS!E495","v":0},0,0,0,0,0]
[151,{"$f":"PRRAS!C496","v":483},{"$f":"PRRAS!D496","v":0},{"$f":"PRRAS!E496","v":0},0,0,0,0,0]
[151,{"$f":"PRRAS!C497","v":484},{"$f":"PRRAS!D497","v":0},{"$f":"PRRAS!E497","v":0},0,0,0,0,0]
[151,{"$f":"PRRAS!C498","v":485},{"$f":"PRRAS!D498","v":0},{"$f":"PRRAS!E498","v":0},0,0,0,0,0]
[151,{"$f":"PRRAS!C499","v":486},{"$f":"PRRAS!D499","v":0},{"$f":"PRRAS!E499","v":0},0,0,0,0,0]
[151,{"$f":"PRRAS!C500","v":487},{"$f":"PRRAS!D500","v":0},{"$f":"PRRAS!E500","v":0},0,0,0,0,0]
[151,{"$f":"PRRAS!C501","v":488},{"$f":"PRRAS!D501","v":0},{"$f":"PRRAS!E501","v":0},0,0,0,0,0]
[151,{"$f":"PRRAS!C502","v":489},{"$f":"PRRAS!D502","v":0},{"$f":"PRRAS!E502","v":0},0,0,0,0,0]
[151,{"$f":"PRRAS!C503","v":490},{"$f":"PRRAS!D503","v":0},{"$f":"PRRAS!E503","v":0},0,0,0,0,0]
[151,{"$f":"PRRAS!C504","v":491},{"$f":"PRRAS!D504","v":0},{"$f":"PRRAS!E504","v":0},0,0,0,0,0]
[151,{"$f":"PRRAS!C505","v":492},{"$f":"PRRAS!D505","v":0},{"$f":"PRRAS!E505","v":0},0,0,0,0,0]
[151,{"$f":"PRRAS!C506","v":493},{"$f":"PRRAS!D506","v":0},{"$f":"PRRAS!E506","v":0},0,0,0,0,0]
[151,{"$f":"PRRAS!C507","v":494},{"$f":"PRRAS!D507","v":0},{"$f":"PRRAS!E507","v":0},0,0,0,0,0]
[151,{"$f":"PRRAS!C508","v":495},{"$f":"PRRAS!D508","v":0},{"$f":"PRRAS!E508","v":0},0,0,0,0,0]
[151,{"$f":"PRRAS!C509","v":496},{"$f":"PRRAS!D509","v":0},{"$f":"PRRAS!E509","v":0},0,0,0,0,0]
[151,{"$f":"PRRAS!C510","v":497},{"$f":"PRRAS!D510","v":0},{"$f":"PRRAS!E510","v":0},0,0,0,0,0]
[151,{"$f":"PRRAS!C511","v":498},{"$f":"PRRAS!D511","v":0},{"$f":"PRRAS!E511","v":0},0,0,0,0,0]
[151,{"$f":"PRRAS!C512","v":499},{"$f":"PRRAS!D512","v":0},{"$f":"PRRAS!E512","v":0},0,0,0,0,0]
[151,{"$f":"PRRAS!C513","v":500},{"$f":"PRRAS!D513","v":0},{"$f":"PRRAS!E513","v":0},0,0,0,0,0]
[151,{"$f":"PRRAS!C514","v":501},{"$f":"PRRAS!D514","v":0},{"$f":"PRRAS!E514","v":0},0,0,0,0,0]
[151,{"$f":"PRRAS!C515","v":502},{"$f":"PRRAS!D515","v":0},{"$f":"PRRAS!E515","v":0},0,0,0,0,0]
[151,{"$f":"PRRAS!C516","v":503},{"$f":"PRRAS!D516","v":0},{"$f":"PRRAS!E516","v":0},0,0,0,0,0]
[151,{"$f":"PRRAS!C517","v":504},{"$f":"PRRAS!D517","v":0},{"$f":"PRRAS!E517","v":0},0,0,0,0,0]
[151,{"$f":"PRRAS!C518","v":505},{"$f":"PRRAS!D518","v":0},{"$f":"PRRAS!E518","v":0},0,0,0,0,0]
[151,{"$f":"PRRAS!C519","v":506},{"$f":"PRRAS!D519","v":0},{"$f":"PRRAS!E519","v":0},0,0,0,0,0]
[151,{"$f":"PRRAS!C520","v":507},{"$f":"PRRAS!D520","v":0},{"$f":"PRRAS!E520","v":0},0,0,0,0,0]
[151,{"$f":"PRRAS!C521","v":508},{"$f":"PRRAS!D521","v":0},{"$f":"PRRAS!E521","v":0},0,0,0,0,0]
[151,{"$f":"PRRAS!C522","v":509},{"$f":"PRRAS!D522","v":0},{"$f":"PRRAS!E522","v":0},0,0,0,0,0]
[151,{"$f":"PRRAS!C523","v":510},{"$f":"PRRAS!D523","v":0},{"$f":"PRRAS!E523","v":0},0,0,0,0,0]
[151,{"$f":"PRRAS!C524","v":511},{"$f":"PRRAS!D524","v":0},{"$f":"PRRAS!E524","v":0},0,0,0,0,0]
[151,{"$f":"PRRAS!C525","v":512},{"$f":"PRRAS!D525","v":0},{"$f":"PRRAS!E525","v":0},0,0,0,0,0]
[151,{"$f":"PRRAS!C526","v":513},{"$f":"PRRAS!D526","v":0},{"$f":"PRRAS!E526","v":0},0,0,{"$f":"(B514/1000)*(C514*1+D514*2)","v":0},{"$f":"ABS(C514-ROUND(C514,0))+ABS(D514-ROUND(D514,0))","v":0},0]
[151,{"$f":"PRRAS!C527","v":514},{"$f":"PRRAS!D527","v":0},{"$f":"PRRAS!E527","v":0},0,0,0,0,0]
[151,{"$f":"PRRAS!C528","v":515},{"$f":"PRRAS!D528","v":0},{"$f":"PRRAS!E528","v":0},0,0,0,0,0]
[151,{"$f":"PRRAS!C529","v":516},{"$f":"PRRAS!D529","v":0},{"$f":"PRRAS!E529","v":0},0,0,0,0,0]
[151,{"$f":"PRRAS!C530","v":517},{"$f":"PRRAS!D530","v":0},{"$f":"PRRAS!E530","v":0},0,0,0,0,0]
[151,{"$f":"PRRAS!C531","v":518},{"$f":"PRRAS!D531","v":0},{"$f":"PRRAS!E531","v":0},0,0,0,0,0]
[151,{"$f":"PRRAS!C532","v":519},{"$f":"PRRAS!D532","v":0},{"$f":"PRRAS!E532","v":0},0,0,0,0,0]
[151,{"$f":"PRRAS!C533","v":520},{"$f":"PRRAS!D533","v":0},{"$f":"PRRAS!E533","v":0},0,0,0,0,0]
[151,{"$f":"PRRAS!C534","v":521},{"$f":"PRRAS!D534","v":0},{"$f":"PRRAS!E534","v":0},0,0,0,0,0]
[151,{"$f":"PRRAS!C535","v":522},{"$f":"PRRAS!D535","v":0},{"$f":"PRRAS!E535","v":0},0,0,0,0,0]
[151,{"$f":"PRRAS!C536","v":523},{"$f":"PRRAS!D536","v":0},{"$f":"PRRAS!E536","v":0},0,0,0,0,0]
[151,{"$f":"PRRAS!C537","v":524},{"$f":"PRRAS!D537","v":0},{"$f":"PRRAS!E537","v":0},0,0,0,0,0]
[151,{"$f":"PRRAS!C538","v":525},{"$f":"PRRAS!D538","v":0},{"$f":"PRRAS!E538","v":0},0,0,0,0,0]
[151,{"$f":"PRRAS!C539","v":526},{"$f":"PRRAS!D539","v":0},{"$f":"PRRAS!E539","v":0},0,0,0,0,0]
[151,{"$f":"PRRAS!C540","v":527},{"$f":"PRRAS!D540","v":0},{"$f":"PRRAS!E540","v":0},0,0,0,0,0]
[151,{"$f":"PRRAS!C541","v":528},{"$f":"PRRAS!D541","v":0},{"$f":"PRRAS!E541","v":0},0,0,0,0,0]
[151,{"$f":"PRRAS!C542","v":529},{"$f":"PRRAS!D542","v":0},{"$f":"PRRAS!E542","v":0},0,0,0,0,0]
[151,{"$f":"PRRAS!C543","v":530},{"$f":"PRRAS!D543","v":0},{"$f":"PRRAS!E543","v":0},0,0,0,0,0]
[151,{"$f":"PRRAS!C544","v":531},{"$f":"PRRAS!D544","v":0},{"$f":"PRRAS!E544","v":0},0,0,0,0,0]
[151,{"$f":"PRRAS!C545","v":532},{"$f":"PRRAS!D545","v":0},{"$f":"PRRAS!E545","v":0},0,0,0,0,0]
[151,{"$f":"PRRAS!C546","v":533},{"$f":"PRRAS!D546","v":0},{"$f":"PRRAS!E546","v":0},0,0,0,0,0]
[151,{"$f":"PRRAS!C547","v":534},{"$f":"PRRAS!D547","v":0},{"$f":"PRRAS!E547","v":0},0,0,0,0,0]
[151,{"$f":"PRRAS!C548","v":535},{"$f":"PRRAS!D548","v":0},{"$f":"PRRAS!E548","v":0},0,0,0,0,0]
[151,{"$f":"PRRAS!C549","v":536},{"$f":"PRRAS!D549","v":0},{"$f":"PRRAS!E549","v":0},0,0,0,0,0]
[151,{"$f":"PRRAS!C550","v":537},{"$f":"PRRAS!D550","v":0},{"$f":"PRRAS!E550","v":0},0,0,0,0,0]
[151,{"$f":"PRRAS!C551","v":538},{"$f":"PRRAS!D551","v":0},{"$f":"PRRAS!E551","v":0},0,0,0,0,0]
[151,{"$f":"PRRAS!C552","v":539},{"$f":"PRRAS!D552","v":0},{"$f":"PRRAS!E552","v":0},0,0,0,0,0]
[151,{"$f":"PRRAS!C553","v":540},{"$f":"PRRAS!D553","v":0},{"$f":"PRRAS!E553","v":0},0,0,0,0,0]
[151,{"$f":"PRRAS!C554","v":541},{"$f":"PRRAS!D554","v":0},{"$f":"PRRAS!E554","v":0},0,0,0,0,0]
[151,{"$f":"PRRAS!C555","v":542},{"$f":"PRRAS!D555","v":0},{"$f":"PRRAS!E555","v":0},0,0,0,0,0]
[151,{"$f":"PRRAS!C556","v":543},{"$f":"PRRAS!D556","v":0},{"$f":"PRRAS!E556","v":0},0,0,0,0,0]
[151,{"$f":"PRRAS!C557","v":544},{"$f":"PRRAS!D557","v":0},{"$f":"PRRAS!E557","v":0},0,0,0,0,0]
[151,{"$f":"PRRAS!C558","v":545},{"$f":"PRRAS!D558","v":0},{"$f":"PRRAS!E558","v":0},0,0,0,0,0]
[151,{"$f":"PRRAS!C559","v":546},{"$f":"PRRAS!D559","v":0},{"$f":"PRRAS!E559","v":0},0,0,0,0,0]
[151,{"$f":"PRRAS!C560","v":547},{"$f":"PRRAS!D560","v":0},{"$f":"PRRAS!E560","v":0},0,0,0,0,0]
[151,{"$f":"PRRAS!C561","v":548},{"$f":"PRRAS!D561","v":0},{"$f":"PRRAS!E561","v":0},0,0,0,0,0]
[151,{"$f":"PRRAS!C562","v":549},{"$f":"PRRAS!D562","v":0},{"$f":"PRRAS!E562","v":0},0,0,0,0,0]
[151,{"$f":"PRRAS!C563","v":550},{"$f":"PRRAS!D563","v":0},{"$f":"PRRAS!E563","v":0},0,0,0,0,0]
[151,{"$f":"PRRAS!C564","v":551},{"$f":"PRRAS!D564","v":0},{"$f":"PRRAS!E564","v":0},0,0,0,0,0]
[151,{"$f":"PRRAS!C565","v":552},{"$f":"PRRAS!D565","v":0},{"$f":"PRRAS!E565","v":0},0,0,0,0,0]
[151,{"$f":"PRRAS!C566","v":553},{"$f":"PRRAS!D566","v":0},{"$f":"PRRAS!E566","v":0},0,0,0,0,0]
[151,{"$f":"PRRAS!C567","v":554},{"$f":"PRRAS!D567","v":0},{"$f":"PRRAS!E567","v":0},0,0,0,0,0]
[151,{"$f":"PRRAS!C568","v":555},{"$f":"PRRAS!D568","v":0},{"$f":"PRRAS!E568","v":0},0,0,0,0,0]
[151,{"$f":"PRRAS!C569","v":556},{"$f":"PRRAS!D569","v":0},{"$f":"PRRAS!E569","v":0},0,0,0,0,0]
[151,{"$f":"PRRAS!C570","v":557},{"$f":"PRRAS!D570","v":0},{"$f":"PRRAS!E570","v":0},0,0,0,0,0]
[151,{"$f":"PRRAS!C571","v":558},{"$f":"PRRAS!D571","v":0},{"$f":"PRRAS!E571","v":0},0,0,0,0,0]
[151,{"$f":"PRRAS!C572","v":559},{"$f":"PRRAS!D572","v":0},{"$f":"PRRAS!E572","v":0},0,0,0,0,0]
[151,{"$f":"PRRAS!C573","v":560},{"$f":"PRRAS!D573","v":0},{"$f":"PRRAS!E573","v":0},0,0,0,0,0]
[151,{"$f":"PRRAS!C574","v":561},{"$f":"PRRAS!D574","v":0},{"$f":"PRRAS!E574","v":0},0,0,0,0,0]
[151,{"$f":"PRRAS!C575","v":562},{"$f":"PRRAS!D575","v":0},{"$f":"PRRAS!E575","v":0},0,0,0,0,0]
[151,{"$f":"PRRAS!C576","v":563},{"$f":"PRRAS!D576","v":0},{"$f":"PRRAS!E576","v":0},0,0,0,0,0]
[151,{"$f":"PRRAS!C577","v":564},{"$f":"PRRAS!D577","v":0},{"$f":"PRRAS!E577","v":0},0,0,0,0,0]
[151,{"$f":"PRRAS!C578","v":565},{"$f":"PRRAS!D578","v":0},{"$f":"PRRAS!E578","v":0},0,0,0,0,0]
[151,{"$f":"PRRAS!C579","v":566},{"$f":"PRRAS!D579","v":0},{"$f":"PRRAS!E579","v":0},0,0,0,0,0]
[151,{"$f":"PRRAS!C580","v":567},{"$f":"PRRAS!D580","v":0},{"$f":"PRRAS!E580","v":0},0,0,0,0,0]
[151,{"$f":"PRRAS!C581","v":568},{"$f":"PRRAS!D581","v":0},{"$f":"PRRAS!E581","v":0},0,0,0,0,0]
[151,{"$f":"PRRAS!C582","v":569},{"$f":"PRRAS!D582","v":0},{"$f":"PRRAS!E582","v":0},0,0,0,0,0]
[151,{"$f":"PRRAS!C583","v":570},{"$f":"PRRAS!D583","v":0},{"$f":"PRRAS!E583","v":0},0,0,0,0,0]
[151,{"$f":"PRRAS!C584","v":571},{"$f":"PRRAS!D584","v":0},{"$f":"PRRAS!E584","v":0},0,0,0,0,0]
[151,{"$f":"PRRAS!C585","v":572},{"$f":"PRRAS!D585","v":0},{"$f":"PRRAS!E585","v":0},0,0,0,0,0]
[151,{"$f":"PRRAS!C586","v":573},{"$f":"PRRAS!D586","v":0},{"$f":"PRRAS!E586","v":0},0,0,0,0,0]
[151,{"$f":"PRRAS!C587","v":574},{"$f":"PRRAS!D587","v":0},{"$f":"PRRAS!E587","v":0},0,0,0,0,0]
[151,{"$f":"PRRAS!C588","v":575},{"$f":"PRRAS!D588","v":0},{"$f":"PRRAS!E588","v":0},0,0,0,0,0]
[151,{"$f":"PRRAS!C589","v":576},{"$f":"PRRAS!D589","v":0},{"$f":"PRRAS!E589","v":0},0,0,0,0,0]
[151,{"$f":"PRRAS!C590","v":577},{"$f":"PRRAS!D590","v":0},{"$f":"PRRAS!E590","v":0},0,0,{"$f":"(B578/1000)*(C578*1+D578*2)","v":0},{"$f":"ABS(C578-ROUND(C578,0))+ABS(D578-ROUND(D578,0))","v":0},0]
[151,{"$f":"PRRAS!C591","v":578},{"$f":"PRRAS!D591","v":0},{"$f":"PRRAS!E591","v":0},0,0,0,0,0]
[151,{"$f":"PRRAS!C592","v":579},{"$f":"PRRAS!D592","v":0},{"$f":"PRRAS!E592","v":0},0,0,0,0,0]
[151,{"$f":"PRRAS!C593","v":580},{"$f":"PRRAS!D593","v":0},{"$f":"PRRAS!E593","v":0},0,0,0,0,0]
[151,{"$f":"PRRAS!C594","v":581},{"$f":"PRRAS!D594","v":0},{"$f":"PRRAS!E594","v":0},0,0,0,0,0]
[151,{"$f":"PRRAS!C595","v":582},{"$f":"PRRAS!D595","v":0},{"$f":"PRRAS!E595","v":0},0,0,0,0,0]
[151,{"$f":"PRRAS!C596","v":583},{"$f":"PRRAS!D596","v":0},{"$f":"PRRAS!E596","v":0},0,0,0,0,0]
[151,{"$f":"PRRAS!C597","v":584},{"$f":"PRRAS!D597","v":0},{"$f":"PRRAS!E597","v":0},0,0,0,0,0]
[151,{"$f":"PRRAS!C598","v":585},{"$f":"PRRAS!D598","v":0},{"$f":"PRRAS!E598","v":0},0,0,0,0,0]
[151,{"$f":"PRRAS!C599","v":586},{"$f":"PRRAS!D599","v":0},{"$f":"PRRAS!E599","v":0},0,0,0,0,0]
[151,{"$f":"PRRAS!C600","v":587},{"$f":"PRRAS!D600","v":0},{"$f":"PRRAS!E600","v":0},0,0,0,0,0]
[151,{"$f":"PRRAS!C601","v":588},{"$f":"PRRAS!D601","v":0},{"$f":"PRRAS!E601","v":0},0,0,0,0,0]
[151,{"$f":"PRRAS!C602","v":589},{"$f":"PRRAS!D602","v":0},{"$f":"PRRAS!E602","v":0},0,0,0,0,0]
[151,{"$f":"PRRAS!C603","v":590},{"$f":"PRRAS!D603","v":0},{"$f":"PRRAS!E603","v":0},0,0,0,0,0]
[151,{"$f":"PRRAS!C604","v":591},{"$f":"PRRAS!D604","v":0},{"$f":"PRRAS!E604","v":0},0,0,0,0,0]
[151,{"$f":"PRRAS!C605","v":592},{"$f":"PRRAS!D605","v":0},{"$f":"PRRAS!E605","v":0},0,0,0,0,0]
[151,{"$f":"PRRAS!C606","v":593},{"$f":"PRRAS!D606","v":0},{"$f":"PRRAS!E606","v":0},0,0,0,0,0]
[151,{"$f":"PRRAS!C607","v":594},{"$f":"PRRAS!D607","v":0},{"$f":"PRRAS!E607","v":0},0,0,0,0,0]
[151,{"$f":"PRRAS!C608","v":595},{"$f":"PRRAS!D608","v":0},{"$f":"PRRAS!E608","v":0},0,0,0,0,0]
[151,{"$f":"PRRAS!C609","v":596},{"$f":"PRRAS!D609","v":0},{"$f":"PRRAS!E609","v":0},0,0,0,0,0]
[151,{"$f":"PRRAS!C610","v":597},{"$f":"PRRAS!D610","v":0},{"$f":"PRRAS!E610","v":0},0,0,0,0,0]
[151,{"$f":"PRRAS!C611","v":598},{"$f":"PRRAS!D611","v":0},{"$f":"PRRAS!E611","v":0},0,0,0,0,0]
[151,{"$f":"PRRAS!C612","v":599},{"$f":"PRRAS!D612","v":0},{"$f":"PRRAS!E612","v":0},0,0,0,0,0]
[151,{"$f":"PRRAS!C613","v":600},{"$f":"PRRAS!D613","v":0},{"$f":"PRRAS!E613","v":0},0,0,0,0,0]
[151,{"$f":"PRRAS!C614","v":601},{"$f":"PRRAS!D614","v":0},{"$f":"PRRAS!E614","v":0},0,0,0,0,0]
[151,{"$f":"PRRAS!C615","v":602},{"$f":"PRRAS!D615","v":0},{"$f":"PRRAS!E615","v":0},0,0,0,0,0]
[151,{"$f":"PRRAS!C616","v":603},{"$f":"PRRAS!D616","v":0},{"$f":"PRRAS!E616","v":0},0,0,0,0,0]
[151,{"$f":"PRRAS!C617","v":604},{"$f":"PRRAS!D617","v":0},{"$f":"PRRAS!E617","v":0},0,0,0,0,0]
[151,{"$f":"PRRAS!C618","v":605},{"$f":"PRRAS!D618","v":0},{"$f":"PRRAS!E618","v":0},0,0,0,0,0]
[151,{"$f":"PRRAS!C619","v":606},{"$f":"PRRAS!D619","v":0},{"$f":"PRRAS!E619","v":0},0,0,0,0,0]
[151,{"$f":"PRRAS!C620","v":607},{"$f":"PRRAS!D620","v":0},{"$f":"PRRAS!E620","v":0},0,0,0,0,0]
[151,{"$f":"PRRAS!C621","v":608},{"$f":"PRRAS!D621","v":0},{"$f":"PRRAS!E621","v":0},0,0,0,0,0]
[151,{"$f":"PRRAS!C622","v":609},{"$f":"PRRAS!D622","v":0},{"$f":"PRRAS!E622","v":0},0,0,0,0,0]
[151,{"$f":"PRRAS!C623","v":610},{"$f":"PRRAS!D623","v":0},{"$f":"PRRAS!E623","v":0},0,0,0,0,0]
[151,{"$f":"PRRAS!C624","v":611},{"$f":"PRRAS!D624","v":0},{"$f":"PRRAS!E624","v":0},0,0,0,0,0]
[151,{"$f":"PRRAS!C625","v":612},{"$f":"PRRAS!D625","v":0},{"$f":"PRRAS!E625","v":0},0,0,0,0,0]
[151,{"$f":"PRRAS!C626","v":613},{"$f":"PRRAS!D626","v":0},{"$f":"PRRAS!E626","v":0},0,0,0,0,0]
[151,{"$f":"PRRAS!C627","v":614},{"$f":"PRRAS!D627","v":0},{"$f":"PRRAS!E627","v":0},0,0,0,0,0]
[151,{"$f":"PRRAS!C628","v":615},{"$f":"PRRAS!D628","v":0},{"$f":"PRRAS!E628","v":0},0,0,0,0,0]
[151,{"$f":"PRRAS!C629","v":616},{"$f":"PRRAS!D629","v":0},{"$f":"PRRAS!E629","v":0},0,0,0,0,0]
[151,{"$f":"PRRAS!C630","v":617},{"$f":"PRRAS!D630","v":0},{"$f":"PRRAS!E630","v":0},0,0,0,0,0]
[151,{"$f":"PRRAS!C631","v":618},{"$f":"PRRAS!D631","v":0},{"$f":"PRRAS!E631","v":0},0,0,0,0,0]
[151,{"$f":"PRRAS!C632","v":619},{"$f":"PRRAS!D632","v":0},{"$f":"PRRAS!E632","v":0},0,0,0,0,0]
[151,{"$f":"PRRAS!C633","v":620},{"$f":"PRRAS!D633","v":0},{"$f":"PRRAS!E633","v":0},0,0,0,0,0]
[151,{"$f":"PRRAS!C634","v":621},{"$f":"PRRAS!D634","v":0},{"$f":"PRRAS!E634","v":0},0,0,0,0,0]
[151,{"$f":"PRRAS!C635","v":622},{"$f":"PRRAS!D635","v":0},{"$f":"PRRAS!E635","v":0},0,0,0,0,0]
[151,{"$f":"PRRAS!C636","v":623},{"$f":"PRRAS!D636","v":0},{"$f":"PRRAS!E636","v":0},0,0,0,0,0]
[151,{"$f":"PRRAS!C637","v":624},{"$f":"PRRAS!D637","v":0},{"$f":"PRRAS!E637","v":0},0,0,0,0,0]
[151,{"$f":"PRRAS!C638","v":625},{"$f":"PRRAS!D638","v":0},{"$f":"PRRAS!E638","v":0},0,0,0,0,0]
[151,{"$f":"PRRAS!C639","v":626},{"$f":"PRRAS!D639","v":0},{"$f":"PRRAS!E639","v":0},0,0,0,0,0]
[151,{"$f":"PRRAS!C640","v":627},{"$f":"PRRAS!D640","v":0},{"$f":"PRRAS!E640","v":0},0,0,0,0,0]
[151,{"$f":"PRRAS!C641","v":628},{"$f":"PRRAS!D641","v":0},{"$f":"PRRAS!E641","v":0},0,0,0,0,0]
[151,{"$f":"PRRAS!C642","v":629},{"$f":"PRRAS!D642","v":7377585},{"$f":"PRRAS!E642","v":7821214},0,0,14479588.176999999,0,0]
[151,{"$f":"PRRAS!C643","v":630},{"$f":"PRRAS!D643","v":7358507},{"$f":"PRRAS!E643","v":7894608},0,0,14583065.49,0,0]
[151,{"$f":"PRRAS!C644","v":631},{"$f":"PRRAS!D644","v":19078},{"$f":"PRRAS!E644","v":0},0,0,12038.218000000001,0,0]
[151,{"$f":"PRRAS!C645","v":632},{"$f":"PRRAS!D645","v":0},{"$f":"PRRAS!E645","v":73394},0,0,92770.016000000003,0,0]
[151,{"$f":"PRRAS!C646","v":633},{"$f":"PRRAS!D646","v":66867},{"$f":"PRRAS!E646","v":85944},0,0,151131.91500000001,0,0]
[151,{"$f":"PRRAS!C647","v":634},{"$f":"PRRAS!D647","v":0},{"$f":"PRRAS!E647","v":0},0,0,0,0,0]
[151,{"$f":"PRRAS!C648","v":635},{"$f":"PRRAS!D648","v":85945},{"$f":"PRRAS!E648","v":12550},0,0,70513.574999999997,0,0]
[151,{"$f":"PRRAS!C649","v":636},{"$f":"PRRAS!D649","v":0},{"$f":"PRRAS!E649","v":0},0,0,0,0,0]
[151,{"$f":"PRRAS!C650","v":637},{"$f":"PRRAS!D650","v":493034},{"$f":"PRRAS!E650","v":561501},0,0,1029414.932,0,0]
[151,{"$f":"PRRAS!C652","v":638},{"$f":"PRRAS!D652","v":166710},{"$f":"PRRAS!E652","v":205268},0,0,368282.94800000003,0,0]
[151,{"$f":"PRRAS!C653","v":639},{"$f":"PRRAS!D653","v":1465049},{"$f":"PRRAS!E653","v":1738711},0,0,3158238.969,0,0]
[151,{"$f":"PRRAS!C654","v":640},{"$f":"PRRAS!D654","v":1426491},{"$f":"PRRAS!E654","v":1816493},0,0,3238065.2800000003,0,0]
[151,{"$f":"PRRAS!C655","v":641},{"$f":"PRRAS!D655","v":205268},{"$f":"PRRAS!E655","v":127486},0,0,{"$f":"(B642/1000)*(C642*1+D642*2)","v":295013.84000000003},{"$f":"ABS(C642-ROUND(C642,0))+ABS(D642-ROUND(D642,0))","v":0},0]
[151,{"$f":"PRRAS!C656","v":642},{"$f":"PRRAS!D656","v":0},{"$f":"PRRAS!E656","v":0},0,0,0,0,0]
[151,{"$f":"PRRAS!C657","v":643},{"$f":"PRRAS!D657","v":54},{"$f":"PRRAS!E657","v":56},0,0,106.738,0,0]
[151,{"$f":"PRRAS!C658","v":644},{"$f":"PRRAS!D658","v":0},{"$f":"PRRAS!E658","v":0},0,0,0,0,0]
[151,{"$f":"PRRAS!C659","v":645},{"$f":"PRRAS!D659","v":52},{"$f":"PRRAS!E659","v":53},0,0,101.91,0,0]
[151,{"$f":"PRRAS!C660","v":646},{"$f":"PRRAS!D660","v":0},{"$f":"PRRAS!E660","v":0},0,0,0,0,0]
[151,{"$f":"PRRAS!C661","v":647},{"$f":"PRRAS!D661","v":0},{"$f":"PRRAS!E661","v":0},0,0,0,0,0]
[151,{"$f":"PRRAS!C662","v":648},{"$f":"PRRAS!D662","v":0},{"$f":"PRRAS!E662","v":0},0,0,0,0,0]
[151,{"$f":"PRRAS!C663","v":649},{"$f":"PRRAS!D663","v":0},{"$f":"PRRAS!E663","v":0},0,0,0,0,0]
[151,{"$f":"PRRAS!C664","v":650},{"$f":"PRRAS!D664","v":3366},{"$f":"PRRAS!E664","v":0},0,0,2187.9,0,0]
[151,{"$f":"PRRAS!C665","v":651},{"$f":"PRRAS!D665","v":0},{"$f":"PRRAS!E665","v":0},0,0,0,0,0]
[151,{"$f":"PRRAS!C666","v":652},{"$f":"PRRAS!D666","v":0},{"$f":"PRRAS!E666","v":0},0,0,0,0,0]
[151,{"$f":"PRRAS!C667","v":653},{"$f":"PRRAS!D667","v":0},{"$f":"PRRAS!E667","v":0},0,0,0,0,0]
[151,{"$f":"PRRAS!C668","v":654},{"$f":"PRRAS!D668","v":0},{"$f":"PRRAS!E668","v":0},0,0,0,0,0]
[151,{"$f":"PRRAS!C669","v":655},{"$f":"PRRAS!D669","v":0},{"$f":"PRRAS!E669","v":0},0,0,0,0,0]
[151,{"$f":"PRRAS!C670","v":656},{"$f":"PRRAS!D670","v":0},{"$f":"PRRAS!E670","v":0},0,0,0,0,0]
[151,{"$f":"PRRAS!C671","v":657},{"$f":"PRRAS!D671","v":0},{"$f":"PRRAS!E671","v":0},0,0,0,0,0]
[151,{"$f":"PRRAS!C672","v":658},{"$f":"PRRAS!D672","v":0},{"$f":"PRRAS!E672","v":0},0,0,0,0,0]
[151,{"$f":"PRRAS!C673","v":659},{"$f":"PRRAS!D673","v":0},{"$f":"PRRAS!E673","v":0},0,0,0,0,0]
[151,{"$f":"PRRAS!C674","v":660},{"$f":"PRRAS!D674","v":0},{"$f":"PRRAS!E674","v":0},0,0,0,0,0]
[151,{"$f":"PRRAS!C675","v":661},{"$f":"PRRAS!D675","v":0},{"$f":"PRRAS!E675","v":0},0,0,0,0,0]
[151,{"$f":"PRRAS!C676","v":662},{"$f":"PRRAS!D676","v":0},{"$f":"PRRAS!E676","v":0},0,0,0,0,0]
[151,{"$f":"PRRAS!C677","v":663},{"$f":"PRRAS!D677","v":0},{"$f":"PRRAS!E677","v":0},0,0,0,0,0]
[151,{"$f":"PRRAS!C678","v":664},{"$f":"PRRAS!D678","v":5902015},{"$f":"PRRAS!E678","v":6257250},0,0,12228565.960000001,0,0]
[151,{"$f":"PRRAS!C679","v":665},{"$f":"PRRAS!D679","v":0},{"$f":"PRRAS!E679","v":0},0,0,0,0,0]
[151,{"$f":"PRRAS!C680","v":666},{"$f":"PRRAS!D680","v":0},{"$f":"PRRAS!E680","v":0},0,0,0,0,0]
[151,{"$f":"PRRAS!C681","v":667},{"$f":"PRRAS!D681","v":0},{"$f":"PRRAS!E681","v":0},0,0,0,0,0]
[151,{"$f":"PRRAS!C682","v":668},{"$f":"PRRAS!D682","v":0},{"$f":"PRRAS!E682","v":0},0,0,0,0,0]
[151,{"$f":"PRRAS!C683","v":669},{"$f":"PRRAS!D683","v":0},{"$f":"PRRAS!E683","v":0},0,0,0,0,0]
[151,{"$f":"PRRAS!C684","v":670},{"$f":"PRRAS!D684","v":0},{"$f":"PRRAS!E684","v":0},0,0,0,0,0]
[151,{"$f":"PRRAS!C685","v":671},{"$f":"PRRAS!D685","v":0},{"$f":"PRRAS!E685","v":0},0,0,0,0,0]
[151,{"$f":"PRRAS!C686","v":672},{"$f":"PRRAS!D686","v":0},{"$f":"PRRAS!E686","v":0},0,0,0,0,0]
[151,{"$f":"PRRAS!C687","v":673},{"$f":"PRRAS!D687","v":0},{"$f":"PRRAS!E687","v":0},0,0,0,0,0]
[151,{"$f":"PRRAS!C688","v":674},{"$f":"PRRAS!D688","v":0},{"$f":"PRRAS!E688","v":0},0,0,0,0,0]
[151,{"$f":"PRRAS!C689","v":675},{"$f":"PRRAS!D689","v":0},{"$f":"PRRAS!E689","v":0},0,0,0,0,0]
[151,{"$f":"PRRAS!C690","v":676},{"$f":"PRRAS!D690","v":0},{"$f":"PRRAS!E690","v":0},0,0,0,0,0]
[151,{"$f":"PRRAS!C691","v":677},{"$f":"PRRAS!D691","v":0},{"$f":"PRRAS!E691","v":0},0,0,0,0,0]
[151,{"$f":"PRRAS!C692","v":678},{"$f":"PRRAS!D692","v":0},{"$f":"PRRAS!E692","v":0},0,0,0,0,0]
[151,{"$f":"PRRAS!C693","v":679},{"$f":"PRRAS!D693","v":0},{"$f":"PRRAS!E693","v":0},0,0,0,0,0]
[151,{"$f":"PRRAS!C694","v":680},{"$f":"PRRAS!D694","v":0},{"$f":"PRRAS!E694","v":0},0,0,0,0,0]
[151,{"$f":"PRRAS!C695","v":681},{"$f":"PRRAS!D695","v":0},{"$f":"PRRAS!E695","v":0},0,0,0,0,0]
[151,{"$f":"PRRAS!C696","v":682},{"$f":"PRRAS!D696","v":0},{"$f":"PRRAS!E696","v":0},0,0,0,0,0]
[151,{"$f":"PRRAS!C697","v":683},{"$f":"PRRAS!D697","v":0},{"$f":"PRRAS!E697","v":0},0,0,0,0,0]
[151,{"$f":"PRRAS!C698","v":684},{"$f":"PRRAS!D698","v":484200},{"$f":"PRRAS!E698","v":480507},0,0,988526.37600000005,0,0]
[151,{"$f":"PRRAS!C699","v":685},{"$f":"PRRAS!D699","v":0},{"$f":"PRRAS!E699","v":0},0,0,0,0,0]
[151,{"$f":"PRRAS!C700","v":686},{"$f":"PRRAS!D700","v":0},{"$f":"PRRAS!E700","v":0},0,0,0,0,0]
[151,{"$f":"PRRAS!C701","v":687},{"$f":"PRRAS!D701","v":12038},{"$f":"PRRAS!E701","v":23952},0,0,41180.154000000002,0,0]
[151,{"$f":"PRRAS!C702","v":688},{"$f":"PRRAS!D702","v":17467},{"$f":"PRRAS!E702","v":28538},0,0,51285.583999999995,0,0]
[151,{"$f":"PRRAS!C703","v":689},{"$f":"PRRAS!D703","v":104276},{"$f":"PRRAS!E703","v":107166},0,0,219520.91199999998,0,0]
[151,{"$f":"PRRAS!C704","v":690},{"$f":"PRRAS!D704","v":0},{"$f":"PRRAS!E704","v":0},0,0,0,0,0]
[151,{"$f":"PRRAS!C705","v":691},{"$f":"PRRAS!D705","v":13638},{"$f":"PRRAS!E705","v":19414},0,0,36254.005999999994,0,0]
[151,{"$f":"PRRAS!C706","v":692},{"$f":"PRRAS!D706","v":0},{"$f":"PRRAS!E706","v":0},0,0,0,0,0]
[151,{"$f":"PRRAS!C707","v":693},{"$f":"PRRAS!D707","v":15732},{"$f":"PRRAS!E707","v":18609},0,0,36694.35,0,0]
[151,{"$f":"PRRAS!C708","v":694},{"$f":"PRRAS!D708","v":0},{"$f":"PRRAS!E708","v":0},0,0,0,0,0]
[151,{"$f":"PRRAS!C709","v":695},{"$f":"PRRAS!D709","v":19683},{"$f":"PRRAS!E709","v":17381},0,0,37839.274999999994,0,0]
[151,{"$f":"PRRAS!C710","v":696},{"$f":"PRRAS!D710","v":0},{"$f":"PRRAS!E710","v":0},0,0,0,0,0]
[151,{"$f":"PRRAS!C711","v":697},{"$f":"PRRAS!D711","v":0},{"$f":"PRRAS!E711","v":0},0,0,0,0,0]
[151,{"$f":"PRRAS!C712","v":698},{"$f":"PRRAS!D712","v":0},{"$f":"PRRAS!E712","v":0},0,0,0,0,0]
[151,{"$f":"PRRAS!C713","v":699},{"$f":"PRRAS!D713","v":0},{"$f":"PRRAS!E713","v":0},0,0,0,0,0]
[151,{"$f":"PRRAS!C714","v":700},{"$f":"PRRAS!D714","v":0},{"$f":"PRRAS!E714","v":0},0,0,0,0,0]
[151,{"$f":"PRRAS!C715","v":701},{"$f":"PRRAS!D715","v":0},{"$f":"PRRAS!E715","v":0},0,0,0,0,0]
[151,{"$f":"PRRAS!C716","v":702},{"$f":"PRRAS!D716","v":0},{"$f":"PRRAS!E716","v":0},0,0,0,0,0]
[151,{"$f":"PRRAS!C717","v":703},{"$f":"PRRAS!D717","v":0},{"$f":"PRRAS!E717","v":0},0,0,0,0,0]
[151,{"$f":"PRRAS!C718","v":704},{"$f":"PRRAS!D718","v":0},{"$f":"PRRAS!E718","v":0},0,0,0,0,0]
[151,{"$f":"PRRAS!C719","v":705},{"$f":"PRRAS!D719","v":0},{"$f":"PRRAS!E719","v":0},0,0,{"$f":"(B706/1000)*(C706*1+D706*2)","v":0},{"$f":"ABS(C706-ROUND(C706,0))+ABS(D706-ROUND(D706,0))","v":0},0]
[151,{"$f":"PRRAS!C720","v":706},{"$f":"PRRAS!D720","v":0},{"$f":"PRRAS!E720","v":0},0,0,0,0,0]
[151,{"$f":"PRRAS!C721","v":707},{"$f":"PRRAS!D721","v":0},{"$f":"PRRAS!E721","v":0},0,0,0,0,0]
[151,{"$f":"PRRAS!C722","v":708},{"$f":"PRRAS!D722","v":0},{"$f":"PRRAS!E722","v":0},0,0,0,0,0]
[151,{"$f":"PRRAS!C723","v":709},{"$f":"PRRAS!D723","v":0},{"$f":"PRRAS!E723","v":0},0,0,0,0,0]
[151,{"$f":"PRRAS!C724","v":710},{"$f":"PRRAS!D724","v":0},{"$f":"PRRAS!E724","v":0},0,0,0,0,0]
[151,{"$f":"PRRAS!C725","v":711},{"$f":"PRRAS!D725","v":0},{"$f":"PRRAS!E725","v":0},0,0,0,0,0]
[151,{"$f":"PRRAS!C726","v":712},{"$f":"PRRAS!D726","v":0},{"$f":"PRRAS!E726","v":0},0,0,0,0,0]
[151,{"$f":"PRRAS!C727","v":713},{"$f":"PRRAS!D727","v":0},{"$f":"PRRAS!E727","v":0},0,0,0,0,0]
[151,{"$f":"PRRAS!C728","v":714},{"$f":"PRRAS!D728","v":0},{"$f":"PRRAS!E728","v":0},0,0,0,0,0]
[151,{"$f":"PRRAS!C729","v":715},{"$f":"PRRAS!D729","v":0},{"$f":"PRRAS!E729","v":0},0,0,0,0,0]
[151,{"$f":"PRRAS!C730","v":716},{"$f":"PRRAS!D730","v":0},{"$f":"PRRAS!E730","v":0},0,0,0,0,0]
[151,{"$f":"PRRAS!C731","v":717},{"$f":"PRRAS!D731","v":0},{"$f":"PRRAS!E731","v":0},0,0,0,0,0]
[151,{"$f":"PRRAS!C732","v":718},{"$f":"PRRAS!D732","v":0},{"$f":"PRRAS!E732","v":0},0,0,0,0,0]
[151,{"$f":"PRRAS!C733","v":719},{"$f":"PRRAS!D733","v":0},{"$f":"PRRAS!E733","v":0},0,0,0,0,0]
[151,{"$f":"PRRAS!C734","v":720},{"$f":"PRRAS!D734","v":0},{"$f":"PRRAS!E734","v":0},0,0,0,0,0]
[151,{"$f":"PRRAS!C735","v":721},{"$f":"PRRAS!D735","v":0},{"$f":"PRRAS!E735","v":0},0,0,0,0,0]
[151,{"$f":"PRRAS!C736","v":722},{"$f":"PRRAS!D736","v":0},{"$f":"PRRAS!E736","v":0},0,0,0,0,0]
[151,{"$f":"PRRAS!C737","v":723},{"$f":"PRRAS!D737","v":0},{"$f":"PRRAS!E737","v":0},0,0,0,0,0]
[151,{"$f":"PRRAS!C738","v":724},{"$f":"PRRAS!D738","v":0},{"$f":"PRRAS!E738","v":0},0,0,0,0,0]
[151,{"$f":"PRRAS!C739","v":725},{"$f":"PRRAS!D739","v":0},{"$f":"PRRAS!E739","v":0},0,0,0,0,0]
[151,{"$f":"PRRAS!C740","v":726},{"$f":"PRRAS!D740","v":0},{"$f":"PRRAS!E740","v":0},0,0,0,0,0]
[151,{"$f":"PRRAS!C741","v":727},{"$f":"PRRAS!D741","v":0},{"$f":"PRRAS!E741","v":0},0,0,0,0,0]
[151,{"$f":"PRRAS!C742","v":728},{"$f":"PRRAS!D742","v":0},{"$f":"PRRAS!E742","v":0},0,0,0,0,0]
[151,{"$f":"PRRAS!C743","v":729},{"$f":"PRRAS!D743","v":0},{"$f":"PRRAS!E743","v":0},0,0,0,0,0]
[151,{"$f":"PRRAS!C744","v":730},{"$f":"PRRAS!D744","v":0},{"$f":"PRRAS!E744","v":0},0,0,0,0,0]
[151,{"$f":"PRRAS!C745","v":731},{"$f":"PRRAS!D745","v":0},{"$f":"PRRAS!E745","v":0},0,0,0,0,0]
[151,{"$f":"PRRAS!C746","v":732},{"$f":"PRRAS!D746","v":0},{"$f":"PRRAS!E746","v":0},0,0,0,0,0]
[151,{"$f":"PRRAS!C747","v":733},{"$f":"PRRAS!D747","v":0},{"$f":"PRRAS!E747","v":0},0,0,0,0,0]
[151,{"$f":"PRRAS!C748","v":734},{"$f":"PRRAS!D748","v":0},{"$f":"PRRAS!E748","v":0},0,0,0,0,0]
[151,{"$f":"PRRAS!C749","v":735},{"$f":"PRRAS!D749","v":0},{"$f":"PRRAS!E749","v":0},0,0,0,0,0]
[151,{"$f":"PRRAS!C750","v":736},{"$f":"PRRAS!D750","v":0},{"$f":"PRRAS!E750","v":0},0,0,0,0,0]
[151,{"$f":"PRRAS!C751","v":737},{"$f":"PRRAS!D751","v":0},{"$f":"PRRAS!E751","v":0},0,0,0,0,0]
[151,{"$f":"PRRAS!C752","v":738},{"$f":"PRRAS!D752","v":0},{"$f":"PRRAS!E752","v":0},0,0,0,0,0]
[151,{"$f":"PRRAS!C753","v":739},{"$f":"PRRAS!D753","v":0},{"$f":"PRRAS!E753","v":0},0,0,0,0,0]
[151,{"$f":"PRRAS!C754","v":740},{"$f":"PRRAS!D754","v":0},{"$f":"PRRAS!E754","v":0},0,0,0,0,0]
[151,{"$f":"PRRAS!C755","v":741},{"$f":"PRRAS!D755","v":0},{"$f":"PRRAS!E755","v":0},0,0,0,0,0]
[151,{"$f":"PRRAS!C756","v":742},{"$f":"PRRAS!D756","v":0},{"$f":"PRRAS!E756","v":0},0,0,0,0,0]
[151,{"$f":"PRRAS!C757","v":743},{"$f":"PRRAS!D757","v":0},{"$f":"PRRAS!E757","v":0},0,0,0,0,0]
[151,{"$f":"PRRAS!C758","v":744},{"$f":"PRRAS!D758","v":0},{"$f":"PRRAS!E758","v":0},0,0,0,0,0]
[151,{"$f":"PRRAS!C759","v":745},{"$f":"PRRAS!D759","v":0},{"$f":"PRRAS!E759","v":0},0,0,0,0,0]
[151,{"$f":"PRRAS!C760","v":746},{"$f":"PRRAS!D760","v":0},{"$f":"PRRAS!E760","v":0},0,0,0,0,0]
[151,{"$f":"PRRAS!C761","v":747},{"$f":"PRRAS!D761","v":0},{"$f":"PRRAS!E761","v":0},0,0,0,0,0]
[151,{"$f":"PRRAS!C762","v":748},{"$f":"PRRAS!D762","v":0},{"$f":"PRRAS!E762","v":0},0,0,0,0,0]
[151,{"$f":"PRRAS!C763","v":749},{"$f":"PRRAS!D763","v":0},{"$f":"PRRAS!E763","v":0},0,0,0,0,0]
[151,{"$f":"PRRAS!C764","v":750},{"$f":"PRRAS!D764","v":0},{"$f":"PRRAS!E764","v":0},0,0,0,0,0]
[151,{"$f":"PRRAS!C765","v":751},{"$f":"PRRAS!D765","v":0},{"$f":"PRRAS!E765","v":0},0,0,0,0,0]
[151,{"$f":"PRRAS!C766","v":752},{"$f":"PRRAS!D766","v":0},{"$f":"PRRAS!E766","v":0},0,0,0,0,0]
[151,{"$f":"PRRAS!C767","v":753},{"$f":"PRRAS!D767","v":0},{"$f":"PRRAS!E767","v":0},0,0,0,0,0]
[151,{"$f":"PRRAS!C768","v":754},{"$f":"PRRAS!D768","v":0},{"$f":"PRRAS!E768","v":0},0,0,0,0,0]
[151,{"$f":"PRRAS!C769","v":755},{"$f":"PRRAS!D769","v":0},{"$f":"PRRAS!E769","v":0},0,0,0,0,0]
[151,{"$f":"PRRAS!C770","v":756},{"$f":"PRRAS!D770","v":0},{"$f":"PRRAS!E770","v":0},0,0,0,0,0]
[151,{"$f":"PRRAS!C771","v":757},{"$f":"PRRAS!D771","v":0},{"$f":"PRRAS!E771","v":0},0,0,0,0,0]
[151,{"$f":"PRRAS!C772","v":758},{"$f":"PRRAS!D772","v":0},{"$f":"PRRAS!E772","v":0},0,0,0,0,0]
[151,{"$f":"PRRAS!C773","v":759},{"$f":"PRRAS!D773","v":0},{"$f":"PRRAS!E773","v":0},0,0,0,0,0]
[151,{"$f":"PRRAS!C774","v":760},{"$f":"PRRAS!D774","v":0},{"$f":"PRRAS!E774","v":0},0,0,0,0,0]
[151,{"$f":"PRRAS!C775","v":761},{"$f":"PRRAS!D775","v":0},{"$f":"PRRAS!E775","v":0},0,0,0,0,0]
[151,{"$f":"PRRAS!C776","v":762},{"$f":"PRRAS!D776","v":0},{"$f":"PRRAS!E776","v":0},0,0,0,0,0]
[151,{"$f":"PRRAS!C777","v":763},{"$f":"PRRAS!D777","v":0},{"$f":"PRRAS!E777","v":0},0,0,0,0,0]
[151,{"$f":"PRRAS!C778","v":764},{"$f":"PRRAS!D778","v":0},{"$f":"PRRAS!E778","v":0},0,0,0,0,0]
[151,{"$f":"PRRAS!C779","v":765},{"$f":"PRRAS!D779","v":0},{"$f":"PRRAS!E779","v":0},0,0,0,0,0]
[151,{"$f":"PRRAS!C780","v":766},{"$f":"PRRAS!D780","v":0},{"$f":"PRRAS!E780","v":0},0,0,0,0,0]
[151,{"$f":"PRRAS!C781","v":767},{"$f":"PRRAS!D781","v":0},{"$f":"PRRAS!E781","v":0},0,0,0,0,0]
[151,{"$f":"PRRAS!C782","v":768},{"$f":"PRRAS!D782","v":0},{"$f":"PRRAS!E782","v":0},0,0,0,0,0]
[151,{"$f":"PRRAS!C783","v":769},{"$f":"PRRAS!D783","v":0},{"$f":"PRRAS!E783","v":0},0,0,{"$f":"(B770/1000)*(C770*1+D770*2)","v":0},{"$f":"ABS(C770-ROUND(C770,0))+ABS(D770-ROUND(D770,0))","v":0},0]
[151,{"$f":"PRRAS!C784","v":770},{"$f":"PRRAS!D784","v":0},{"$f":"PRRAS!E784","v":0},0,0,0,0,0]
[151,{"$f":"PRRAS!C785","v":771},{"$f":"PRRAS!D785","v":0},{"$f":"PRRAS!E785","v":0},0,0,0,0,0]
[151,{"$f":"PRRAS!C786","v":772},{"$f":"PRRAS!D786","v":0},{"$f":"PRRAS!E786","v":0},0,0,0,0,0]
[151,{"$f":"PRRAS!C787","v":773},{"$f":"PRRAS!D787","v":0},{"$f":"PRRAS!E787","v":0},0,0,0,0,0]
[151,{"$f":"PRRAS!C788","v":774},{"$f":"PRRAS!D788","v":0},{"$f":"PRRAS!E788","v":0},0,0,0,0,0]
[151,{"$f":"PRRAS!C789","v":775},{"$f":"PRRAS!D789","v":0},{"$f":"PRRAS!E789","v":0},0,0,0,0,0]
[151,{"$f":"PRRAS!C790","v":776},{"$f":"PRRAS!D790","v":0},{"$f":"PRRAS!E790","v":0},0,0,0,0,0]
[151,{"$f":"PRRAS!C791","v":777},{"$f":"PRRAS!D791","v":0},{"$f":"PRRAS!E791","v":0},0,0,0,0,0]
[151,{"$f":"PRRAS!C792","v":778},{"$f":"PRRAS!D792","v":0},{"$f":"PRRAS!E792","v":0},0,0,0,0,0]
[151,{"$f":"PRRAS!C793","v":779},{"$f":"PRRAS!D793","v":0},{"$f":"PRRAS!E793","v":0},0,0,0,0,0]
[151,{"$f":"PRRAS!C794","v":780},{"$f":"PRRAS!D794","v":0},{"$f":"PRRAS!E794","v":0},0,0,0,0,0]
[151,{"$f":"PRRAS!C795","v":781},{"$f":"PRRAS!D795","v":0},{"$f":"PRRAS!E795","v":0},0,0,0,0,0]
[151,{"$f":"PRRAS!C796","v":782},{"$f":"PRRAS!D796","v":0},{"$f":"PRRAS!E796","v":0},0,0,0,0,0]
[151,{"$f":"PRRAS!C797","v":783},{"$f":"PRRAS!D797","v":0},{"$f":"PRRAS!E797","v":0},0,0,0,0,0]
[151,{"$f":"PRRAS!C798","v":784},{"$f":"PRRAS!D798","v":0},{"$f":"PRRAS!E798","v":0},0,0,0,0,0]
[151,{"$f":"PRRAS!C799","v":785},{"$f":"PRRAS!D799","v":0},{"$f":"PRRAS!E799","v":0},0,0,0,0,0]
[151,{"$f":"PRRAS!C800","v":786},{"$f":"PRRAS!D800","v":0},{"$f":"PRRAS!E800","v":0},0,0,0,0,0]
[151,{"$f":"PRRAS!C801","v":787},{"$f":"PRRAS!D801","v":0},{"$f":"PRRAS!E801","v":0},0,0,0,0,0]
[151,{"$f":"PRRAS!C802","v":788},{"$f":"PRRAS!D802","v":0},{"$f":"PRRAS!E802","v":0},0,0,0,0,0]
[151,{"$f":"PRRAS!C803","v":789},{"$f":"PRRAS!D803","v":0},{"$f":"PRRAS!E803","v":0},0,0,0,0,0]
[151,{"$f":"PRRAS!C804","v":790},{"$f":"PRRAS!D804","v":0},{"$f":"PRRAS!E804","v":0},0,0,0,0,0]
[151,{"$f":"PRRAS!C805","v":791},{"$f":"PRRAS!D805","v":0},{"$f":"PRRAS!E805","v":0},0,0,0,0,0]
[151,{"$f":"PRRAS!C806","v":792},{"$f":"PRRAS!D806","v":0},{"$f":"PRRAS!E806","v":0},0,0,0,0,0]
[151,{"$f":"PRRAS!C807","v":793},{"$f":"PRRAS!D807","v":0},{"$f":"PRRAS!E807","v":0},0,0,0,0,0]
[151,{"$f":"PRRAS!C808","v":794},{"$f":"PRRAS!D808","v":0},{"$f":"PRRAS!E808","v":0},0,0,0,0,0]
[151,{"$f":"PRRAS!C809","v":795},{"$f":"PRRAS!D809","v":0},{"$f":"PRRAS!E809","v":0},0,0,0,0,0]
[151,{"$f":"PRRAS!C810","v":796},{"$f":"PRRAS!D810","v":0},{"$f":"PRRAS!E810","v":0},0,0,0,0,0]
[151,{"$f":"PRRAS!C811","v":797},{"$f":"PRRAS!D811","v":0},{"$f":"PRRAS!E811","v":0},0,0,0,0,0]
[151,{"$f":"PRRAS!C812","v":798},{"$f":"PRRAS!D812","v":0},{"$f":"PRRAS!E812","v":0},0,0,0,0,0]
[151,{"$f":"PRRAS!C813","v":799},{"$f":"PRRAS!D813","v":0},{"$f":"PRRAS!E813","v":0},0,0,0,0,0]
[151,{"$f":"PRRAS!C814","v":800},{"$f":"PRRAS!D814","v":0},{"$f":"PRRAS!E814","v":0},0,0,0,0,0]
[151,{"$f":"PRRAS!C815","v":801},{"$f":"PRRAS!D815","v":0},{"$f":"PRRAS!E815","v":0},0,0,0,0,0]
[151,{"$f":"PRRAS!C816","v":802},{"$f":"PRRAS!D816","v":0},{"$f":"PRRAS!E816","v":0},0,0,0,0,0]
[151,{"$f":"PRRAS!C817","v":803},{"$f":"PRRAS!D817","v":0},{"$f":"PRRAS!E817","v":0},0,0,0,0,0]
[151,{"$f":"PRRAS!C818","v":804},{"$f":"PRRAS!D818","v":0},{"$f":"PRRAS!E818","v":0},0,0,0,0,0]
[151,{"$f":"PRRAS!C819","v":805},{"$f":"PRRAS!D819","v":0},{"$f":"PRRAS!E819","v":0},0,0,0,0,0]
[151,{"$f":"PRRAS!C820","v":806},{"$f":"PRRAS!D820","v":0},{"$f":"PRRAS!E820","v":0},0,0,0,0,0]
[151,{"$f":"PRRAS!C821","v":807},{"$f":"PRRAS!D821","v":0},{"$f":"PRRAS!E821","v":0},0,0,0,0,0]
[151,{"$f":"PRRAS!C822","v":808},{"$f":"PRRAS!D822","v":0},{"$f":"PRRAS!E822","v":0},0,0,0,0,0]
[151,{"$f":"PRRAS!C823","v":809},{"$f":"PRRAS!D823","v":0},{"$f":"PRRAS!E823","v":0},0,0,0,0,0]
[151,{"$f":"PRRAS!C824","v":810},{"$f":"PRRAS!D824","v":0},{"$f":"PRRAS!E824","v":0},0,0,0,0,0]
[151,{"$f":"PRRAS!C825","v":811},{"$f":"PRRAS!D825","v":0},{"$f":"PRRAS!E825","v":0},0,0,0,0,0]
[151,{"$f":"PRRAS!C826","v":812},{"$f":"PRRAS!D826","v":0},{"$f":"PRRAS!E826","v":0},0,0,0,0,0]
[151,{"$f":"PRRAS!C827","v":813},{"$f":"PRRAS!D827","v":0},{"$f":"PRRAS!E827","v":0},0,0,0,0,0]
[151,{"$f":"PRRAS!C828","v":814},{"$f":"PRRAS!D828","v":0},{"$f":"PRRAS!E828","v":0},0,0,0,0,0]
[151,{"$f":"PRRAS!C829","v":815},{"$f":"PRRAS!D829","v":0},{"$f":"PRRAS!E829","v":0},0,0,0,0,0]
[151,{"$f":"PRRAS!C830","v":816},{"$f":"PRRAS!D830","v":0},{"$f":"PRRAS!E830","v":0},0,0,0,0,0]
[151,{"$f":"PRRAS!C831","v":817},{"$f":"PRRAS!D831","v":0},{"$f":"PRRAS!E831","v":0},0,0,0,0,0]
[151,{"$f":"PRRAS!C832","v":818},{"$f":"PRRAS!D832","v":0},{"$f":"PRRAS!E832","v":0},0,0,0,0,0]
[151,{"$f":"PRRAS!C833","v":819},{"$f":"PRRAS!D833","v":0},{"$f":"PRRAS!E833","v":0},0,0,0,0,0]
[151,{"$f":"PRRAS!C834","v":820},{"$f":"PRRAS!D834","v":0},{"$f":"PRRAS!E834","v":0},0,0,0,0,0]
[151,{"$f":"PRRAS!C835","v":821},{"$f":"PRRAS!D835","v":0},{"$f":"PRRAS!E835","v":0},0,0,0,0,0]
[151,{"$f":"PRRAS!C836","v":822},{"$f":"PRRAS!D836","v":0},{"$f":"PRRAS!E836","v":0},0,0,0,0,0]
[151,{"$f":"PRRAS!C837","v":823},{"$f":"PRRAS!D837","v":0},{"$f":"PRRAS!E837","v":0},0,0,0,0,0]
[151,{"$f":"PRRAS!C838","v":824},{"$f":"PRRAS!D838","v":0},{"$f":"PRRAS!E838","v":0},0,0,0,0,0]
[151,{"$f":"PRRAS!C839","v":825},{"$f":"PRRAS!D839","v":0},{"$f":"PRRAS!E839","v":0},0,0,0,0,0]
[151,{"$f":"PRRAS!C840","v":826},{"$f":"PRRAS!D840","v":0},{"$f":"PRRAS!E840","v":0},0,0,0,0,0]
[151,{"$f":"PRRAS!C841","v":827},{"$f":"PRRAS!D841","v":0},{"$f":"PRRAS!E841","v":0},0,0,0,0,0]
[151,{"$f":"PRRAS!C842","v":828},{"$f":"PRRAS!D842","v":0},{"$f":"PRRAS!E842","v":0},0,0,0,0,0]
[151,{"$f":"PRRAS!C843","v":829},{"$f":"PRRAS!D843","v":0},{"$f":"PRRAS!E843","v":0},0,0,0,0,0]
[151,{"$f":"PRRAS!C844","v":830},{"$f":"PRRAS!D844","v":0},{"$f":"PRRAS!E844","v":0},0,0,0,0,0]
[151,{"$f":"PRRAS!C845","v":831},{"$f":"PRRAS!D845","v":0},{"$f":"PRRAS!E845","v":0},0,0,0,0,0]
[151,{"$f":"PRRAS!C846","v":832},{"$f":"PRRAS!D846","v":0},{"$f":"PRRAS!E846","v":0},0,0,0,0,0]
[151,{"$f":"PRRAS!C847","v":833},{"$f":"PRRAS!D847","v":0},{"$f":"PRRAS!E847","v":0},0,0,{"$f":"(B834/1000)*(C834*1+D834*2)","v":0},{"$f":"ABS(C834-ROUND(C834,0))+ABS(D834-ROUND(D834,0))","v":0},0]
[151,{"$f":"PRRAS!C848","v":834},{"$f":"PRRAS!D848","v":0},{"$f":"PRRAS!E848","v":0},0,0,0,0,0]
[151,{"$f":"PRRAS!C849","v":835},{"$f":"PRRAS!D849","v":0},{"$f":"PRRAS!E849","v":0},0,0,0,0,0]
[151,{"$f":"PRRAS!C850","v":836},{"$f":"PRRAS!D850","v":0},{"$f":"PRRAS!E850","v":0},0,0,0,0,0]
[151,{"$f":"PRRAS!C851","v":837},{"$f":"PRRAS!D851","v":0},{"$f":"PRRAS!E851","v":0},0,0,0,0,0]
[151,{"$f":"PRRAS!C852","v":838},{"$f":"PRRAS!D852","v":0},{"$f":"PRRAS!E852","v":0},0,0,0,0,0]
[151,{"$f":"PRRAS!C853","v":839},{"$f":"PRRAS!D853","v":0},{"$f":"PRRAS!E853","v":0},0,0,0,0,0]
[151,{"$f":"PRRAS!C854","v":840},{"$f":"PRRAS!D854","v":0},{"$f":"PRRAS!E854","v":0},0,0,0,0,0]
[151,{"$f":"PRRAS!C855","v":841},{"$f":"PRRAS!D855","v":0},{"$f":"PRRAS!E855","v":0},0,0,0,0,0]
[151,{"$f":"PRRAS!C856","v":842},{"$f":"PRRAS!D856","v":0},{"$f":"PRRAS!E856","v":0},0,0,0,0,0]
[151,{"$f":"PRRAS!C857","v":843},{"$f":"PRRAS!D857","v":0},{"$f":"PRRAS!E857","v":0},0,0,0,0,0]
[151,{"$f":"PRRAS!C858","v":844},{"$f":"PRRAS!D858","v":0},{"$f":"PRRAS!E858","v":0},0,0,0,0,0]
[151,{"$f":"PRRAS!C859","v":845},{"$f":"PRRAS!D859","v":0},{"$f":"PRRAS!E859","v":0},0,0,0,0,0]
[151,{"$f":"PRRAS!C860","v":846},{"$f":"PRRAS!D860","v":0},{"$f":"PRRAS!E860","v":0},0,0,0,0,0]
[151,{"$f":"PRRAS!C861","v":847},{"$f":"PRRAS!D861","v":0},{"$f":"PRRAS!E861","v":0},0,0,0,0,0]
[151,{"$f":"PRRAS!C862","v":848},{"$f":"PRRAS!D862","v":0},{"$f":"PRRAS!E862","v":0},0,0,0,0,0]
[151,{"$f":"PRRAS!C863","v":849},{"$f":"PRRAS!D863","v":0},{"$f":"PRRAS!E863","v":0},0,0,0,0,0]
[151,{"$f":"PRRAS!C864","v":850},{"$f":"PRRAS!D864","v":0},{"$f":"PRRAS!E864","v":0},0,0,0,0,0]
[151,{"$f":"PRRAS!C865","v":851},{"$f":"PRRAS!D865","v":0},{"$f":"PRRAS!E865","v":0},0,0,0,0,0]
[151,{"$f":"PRRAS!C866","v":852},{"$f":"PRRAS!D866","v":0},{"$f":"PRRAS!E866","v":0},0,0,0,0,0]
[151,{"$f":"PRRAS!C867","v":853},{"$f":"PRRAS!D867","v":0},{"$f":"PRRAS!E867","v":0},0,0,0,0,0]
[151,{"$f":"PRRAS!C868","v":854},{"$f":"PRRAS!D868","v":0},{"$f":"PRRAS!E868","v":0},0,0,0,0,0]
[151,{"$f":"PRRAS!C869","v":855},{"$f":"PRRAS!D869","v":0},{"$f":"PRRAS!E869","v":0},0,0,0,0,0]
[151,{"$f":"PRRAS!C870","v":856},{"$f":"PRRAS!D870","v":0},{"$f":"PRRAS!E870","v":0},0,0,0,0,0]
[151,{"$f":"PRRAS!C871","v":857},{"$f":"PRRAS!D871","v":0},{"$f":"PRRAS!E871","v":0},0,0,0,0,0]
[151,{"$f":"PRRAS!C872","v":858},{"$f":"PRRAS!D872","v":0},{"$f":"PRRAS!E872","v":0},0,0,0,0,0]
[151,{"$f":"PRRAS!C873","v":859},{"$f":"PRRAS!D873","v":0},{"$f":"PRRAS!E873","v":0},0,0,0,0,0]
[151,{"$f":"PRRAS!C874","v":860},{"$f":"PRRAS!D874","v":0},{"$f":"PRRAS!E874","v":0},0,0,0,0,0]
[151,{"$f":"PRRAS!C875","v":861},{"$f":"PRRAS!D875","v":0},{"$f":"PRRAS!E875","v":0},0,0,0,0,0]
[151,{"$f":"PRRAS!C876","v":862},{"$f":"PRRAS!D876","v":0},{"$f":"PRRAS!E876","v":0},0,0,0,0,0]
[151,{"$f":"PRRAS!C877","v":863},{"$f":"PRRAS!D877","v":0},{"$f":"PRRAS!E877","v":0},0,0,0,0,0]
[151,{"$f":"PRRAS!C878","v":864},{"$f":"PRRAS!D878","v":0},{"$f":"PRRAS!E878","v":0},0,0,0,0,0]
[151,{"$f":"PRRAS!C879","v":865},{"$f":"PRRAS!D879","v":0},{"$f":"PRRAS!E879","v":0},0,0,0,0,0]
[151,{"$f":"PRRAS!C880","v":866},{"$f":"PRRAS!D880","v":0},{"$f":"PRRAS!E880","v":0},0,0,0,0,0]
[151,{"$f":"PRRAS!C881","v":867},{"$f":"PRRAS!D881","v":0},{"$f":"PRRAS!E881","v":0},0,0,0,0,0]
[151,{"$f":"PRRAS!C882","v":868},{"$f":"PRRAS!D882","v":0},{"$f":"PRRAS!E882","v":0},0,0,0,0,0]
[151,{"$f":"PRRAS!C883","v":869},{"$f":"PRRAS!D883","v":0},{"$f":"PRRAS!E883","v":0},0,0,0,0,0]
[151,{"$f":"PRRAS!C884","v":870},{"$f":"PRRAS!D884","v":0},{"$f":"PRRAS!E884","v":0},0,0,0,0,0]
[151,{"$f":"PRRAS!C885","v":871},{"$f":"PRRAS!D885","v":0},{"$f":"PRRAS!E885","v":0},0,0,0,0,0]
[151,{"$f":"PRRAS!C886","v":872},{"$f":"PRRAS!D886","v":0},{"$f":"PRRAS!E886","v":0},0,0,0,0,0]
[151,{"$f":"PRRAS!C887","v":873},{"$f":"PRRAS!D887","v":0},{"$f":"PRRAS!E887","v":0},0,0,0,0,0]
[151,{"$f":"PRRAS!C888","v":874},{"$f":"PRRAS!D888","v":0},{"$f":"PRRAS!E888","v":0},0,0,0,0,0]
[151,{"$f":"PRRAS!C889","v":875},{"$f":"PRRAS!D889","v":0},{"$f":"PRRAS!E889","v":0},0,0,0,0,0]
[151,{"$f":"PRRAS!C890","v":876},{"$f":"PRRAS!D890","v":0},{"$f":"PRRAS!E890","v":0},0,0,0,0,0]
[151,{"$f":"PRRAS!C891","v":877},{"$f":"PRRAS!D891","v":0},{"$f":"PRRAS!E891","v":0},0,0,0,0,0]
[151,{"$f":"PRRAS!C892","v":878},{"$f":"PRRAS!D892","v":0},{"$f":"PRRAS!E892","v":0},0,0,0,0,0]
[151,{"$f":"PRRAS!C893","v":879},{"$f":"PRRAS!D893","v":0},{"$f":"PRRAS!E893","v":0},0,0,0,0,0]
[151,{"$f":"PRRAS!C894","v":880},{"$f":"PRRAS!D894","v":0},{"$f":"PRRAS!E894","v":0},0,0,0,0,0]
[151,{"$f":"PRRAS!C895","v":881},{"$f":"PRRAS!D895","v":0},{"$f":"PRRAS!E895","v":0},0,0,0,0,0]
[151,{"$f":"PRRAS!C896","v":882},{"$f":"PRRAS!D896","v":0},{"$f":"PRRAS!E896","v":0},0,0,0,0,0]
[151,{"$f":"PRRAS!C897","v":883},{"$f":"PRRAS!D897","v":0},{"$f":"PRRAS!E897","v":0},0,0,0,0,0]
[151,{"$f":"PRRAS!C898","v":884},{"$f":"PRRAS!D898","v":0},{"$f":"PRRAS!E898","v":0},0,0,0,0,0]
[151,{"$f":"PRRAS!C899","v":885},{"$f":"PRRAS!D899","v":0},{"$f":"PRRAS!E899","v":0},0,0,0,0,0]
[151,{"$f":"PRRAS!C900","v":886},{"$f":"PRRAS!D900","v":0},{"$f":"PRRAS!E900","v":0},0,0,0,0,0]
[151,{"$f":"PRRAS!C901","v":887},{"$f":"PRRAS!D901","v":0},{"$f":"PRRAS!E901","v":0},0,0,0,0,0]
[151,{"$f":"PRRAS!C902","v":888},{"$f":"PRRAS!D902","v":0},{"$f":"PRRAS!E902","v":0},0,0,0,0,0]
[151,{"$f":"PRRAS!C903","v":889},{"$f":"PRRAS!D903","v":0},{"$f":"PRRAS!E903","v":0},0,0,0,0,0]
[151,{"$f":"PRRAS!C904","v":890},{"$f":"PRRAS!D904","v":0},{"$f":"PRRAS!E904","v":0},0,0,0,0,0]
[151,{"$f":"PRRAS!C905","v":891},{"$f":"PRRAS!D905","v":0},{"$f":"PRRAS!E905","v":0},0,0,0,0,0]
[151,{"$f":"PRRAS!C906","v":892},{"$f":"PRRAS!D906","v":0},{"$f":"PRRAS!E906","v":0},0,0,0,0,0]
[151,{"$f":"PRRAS!C907","v":893},{"$f":"PRRAS!D907","v":0},{"$f":"PRRAS!E907","v":0},0,0,0,0,0]
[151,{"$f":"PRRAS!C908","v":894},{"$f":"PRRAS!D908","v":0},{"$f":"PRRAS!E908","v":0},0,0,0,0,0]
[151,{"$f":"PRRAS!C909","v":895},{"$f":"PRRAS!D909","v":0},{"$f":"PRRAS!E909","v":0},0,0,0,0,0]
[151,{"$f":"PRRAS!C910","v":896},{"$f":"PRRAS!D910","v":0},{"$f":"PRRAS!E910","v":0},0,0,0,0,0]
[151,{"$f":"PRRAS!C911","v":897},{"$f":"PRRAS!D911","v":0},{"$f":"PRRAS!E911","v":0},0,0,{"$f":"(B898/1000)*(C898*1+D898*2)","v":0},{"$f":"ABS(C898-ROUND(C898,0))+ABS(D898-ROUND(D898,0))","v":0},0]
[151,{"$f":"PRRAS!C912","v":898},{"$f":"PRRAS!D912","v":0},{"$f":"PRRAS!E912","v":0},0,0,0,0,0]
[151,{"$f":"PRRAS!C913","v":899},{"$f":"PRRAS!D913","v":0},{"$f":"PRRAS!E913","v":0},0,0,0,0,0]
[151,{"$f":"PRRAS!C914","v":900},{"$f":"PRRAS!D914","v":0},{"$f":"PRRAS!E914","v":0},0,0,0,0,0]
[151,{"$f":"PRRAS!C915","v":901},{"$f":"PRRAS!D915","v":0},{"$f":"PRRAS!E915","v":0},0,0,0,0,0]
[151,{"$f":"PRRAS!C916","v":902},{"$f":"PRRAS!D916","v":0},{"$f":"PRRAS!E916","v":0},0,0,0,0,0]
[151,{"$f":"PRRAS!C917","v":903},{"$f":"PRRAS!D917","v":0},{"$f":"PRRAS!E917","v":0},0,0,0,0,0]
[151,{"$f":"PRRAS!C918","v":904},{"$f":"PRRAS!D918","v":0},{"$f":"PRRAS!E918","v":0},0,0,0,0,0]
[151,{"$f":"PRRAS!C919","v":905},{"$f":"PRRAS!D919","v":0},{"$f":"PRRAS!E919","v":0},0,0,0,0,0]
[151,{"$f":"PRRAS!C920","v":906},{"$f":"PRRAS!D920","v":0},{"$f":"PRRAS!E920","v":0},0,0,0,0,0]
[151,{"$f":"PRRAS!C921","v":907},{"$f":"PRRAS!D921","v":0},{"$f":"PRRAS!E921","v":0},0,0,0,0,0]
[151,{"$f":"PRRAS!C922","v":908},{"$f":"PRRAS!D922","v":0},{"$f":"PRRAS!E922","v":0},0,0,0,0,0]
[151,{"$f":"PRRAS!C923","v":909},{"$f":"PRRAS!D923","v":0},{"$f":"PRRAS!E923","v":0},0,0,0,0,0]
[151,{"$f":"PRRAS!C924","v":910},{"$f":"PRRAS!D924","v":0},{"$f":"PRRAS!E924","v":0},0,0,0,0,0]
[151,{"$f":"PRRAS!C925","v":911},{"$f":"PRRAS!D925","v":0},{"$f":"PRRAS!E925","v":0},0,0,0,0,0]
[151,{"$f":"PRRAS!C926","v":912},{"$f":"PRRAS!D926","v":0},{"$f":"PRRAS!E926","v":0},0,0,0,0,0]
[151,{"$f":"PRRAS!C927","v":913},{"$f":"PRRAS!D927","v":0},{"$f":"PRRAS!E927","v":0},0,0,0,0,0]
[151,{"$f":"PRRAS!C928","v":914},{"$f":"PRRAS!D928","v":0},{"$f":"PRRAS!E928","v":0},0,0,0,0,0]
[151,{"$f":"PRRAS!C929","v":915},{"$f":"PRRAS!D929","v":0},{"$f":"PRRAS!E929","v":0},0,0,0,0,0]
[151,{"$f":"PRRAS!C930","v":916},{"$f":"PRRAS!D930","v":0},{"$f":"PRRAS!E930","v":0},0,0,0,0,0]
[151,{"$f":"PRRAS!C931","v":917},{"$f":"PRRAS!D931","v":0},{"$f":"PRRAS!E931","v":0},0,0,0,0,0]
[151,{"$f":"PRRAS!C932","v":918},{"$f":"PRRAS!D932","v":0},{"$f":"PRRAS!E932","v":0},0,0,0,0,0]
[151,{"$f":"PRRAS!C933","v":919},{"$f":"PRRAS!D933","v":0},{"$f":"PRRAS!E933","v":0},0,0,0,0,0]
[151,{"$f":"PRRAS!C934","v":920},{"$f":"PRRAS!D934","v":0},{"$f":"PRRAS!E934","v":0},0,0,0,0,0]
[151,{"$f":"PRRAS!C935","v":921},{"$f":"PRRAS!D935","v":0},{"$f":"PRRAS!E935","v":0},0,0,0,0,0]
[151,{"$f":"PRRAS!C936","v":922},{"$f":"PRRAS!D936","v":0},{"$f":"PRRAS!E936","v":0},0,0,0,0,0]
[151,{"$f":"PRRAS!C937","v":923},{"$f":"PRRAS!D937","v":0},{"$f":"PRRAS!E937","v":0},0,0,0,0,0]
[151,{"$f":"PRRAS!C938","v":924},{"$f":"PRRAS!D938","v":0},{"$f":"PRRAS!E938","v":0},0,0,0,0,0]
[151,{"$f":"PRRAS!C939","v":925},{"$f":"PRRAS!D939","v":0},{"$f":"PRRAS!E939","v":0},0,0,0,0,0]
[151,{"$f":"PRRAS!C940","v":926},{"$f":"PRRAS!D940","v":0},{"$f":"PRRAS!E940","v":0},0,0,0,0,0]
[151,{"$f":"PRRAS!C941","v":927},{"$f":"PRRAS!D941","v":0},{"$f":"PRRAS!E941","v":0},0,0,0,0,0]
[151,{"$f":"PRRAS!C942","v":928},{"$f":"PRRAS!D942","v":0},{"$f":"PRRAS!E942","v":0},0,0,0,0,0]
[151,{"$f":"PRRAS!C943","v":929},{"$f":"PRRAS!D943","v":0},{"$f":"PRRAS!E943","v":0},0,0,0,0,0]
[151,{"$f":"PRRAS!C944","v":930},{"$f":"PRRAS!D944","v":0},{"$f":"PRRAS!E944","v":0},0,0,0,0,0]
[151,{"$f":"PRRAS!C945","v":931},{"$f":"PRRAS!D945","v":0},{"$f":"PRRAS!E945","v":0},0,0,0,0,0]
[151,{"$f":"PRRAS!C946","v":932},{"$f":"PRRAS!D946","v":0},{"$f":"PRRAS!E946","v":0},0,0,0,0,0]
[151,{"$f":"PRRAS!C947","v":933},{"$f":"PRRAS!D947","v":0},{"$f":"PRRAS!E947","v":0},0,0,0,0,0]
[151,{"$f":"PRRAS!C948","v":934},{"$f":"PRRAS!D948","v":0},{"$f":"PRRAS!E948","v":0},0,0,0,0,0]
[151,{"$f":"PRRAS!C949","v":935},{"$f":"PRRAS!D949","v":0},{"$f":"PRRAS!E949","v":0},0,0,0,0,0]
[151,{"$f":"PRRAS!C950","v":936},{"$f":"PRRAS!D950","v":0},{"$f":"PRRAS!E950","v":0},0,0,0,0,0]
[151,{"$f":"PRRAS!C951","v":937},{"$f":"PRRAS!D951","v":0},{"$f":"PRRAS!E951","v":0},0,0,0,0,0]
[151,{"$f":"PRRAS!C952","v":938},{"$f":"PRRAS!D952","v":0},{"$f":"PRRAS!E952","v":0},0,0,0,0,0]
[151,{"$f":"PRRAS!C953","v":939},{"$f":"PRRAS!D953","v":0},{"$f":"PRRAS!E953","v":0},0,0,0,0,0]
[151,{"$f":"PRRAS!C954","v":940},{"$f":"PRRAS!D954","v":0},{"$f":"PRRAS!E954","v":0},0,0,0,0,0]
[151,{"$f":"PRRAS!C955","v":941},{"$f":"PRRAS!D955","v":0},{"$f":"PRRAS!E955","v":0},0,0,0,0,0]
[151,{"$f":"PRRAS!C956","v":942},{"$f":"PRRAS!D956","v":0},{"$f":"PRRAS!E956","v":0},0,0,0,0,0]
[151,{"$f":"PRRAS!C957","v":943},{"$f":"PRRAS!D957","v":0},{"$f":"PRRAS!E957","v":0},0,0,0,0,0]
[151,{"$f":"PRRAS!C958","v":944},{"$f":"PRRAS!D958","v":0},{"$f":"PRRAS!E958","v":0},0,0,0,0,0]
[151,{"$f":"PRRAS!C959","v":945},{"$f":"PRRAS!D959","v":0},{"$f":"PRRAS!E959","v":0},0,0,0,0,0]
[151,{"$f":"PRRAS!C960","v":946},{"$f":"PRRAS!D960","v":0},{"$f":"PRRAS!E960","v":0},0,0,0,0,0]
[151,{"$f":"PRRAS!C961","v":947},{"$f":"PRRAS!D961","v":0},{"$f":"PRRAS!E961","v":0},0,0,0,0,0]
[151,{"$f":"PRRAS!C962","v":948},{"$f":"PRRAS!D962","v":0},{"$f":"PRRAS!E962","v":0},0,0,0,0,0]
[151,{"$f":"PRRAS!C963","v":949},{"$f":"PRRAS!D963","v":0},{"$f":"PRRAS!E963","v":0},0,0,0,0,0]
[151,{"$f":"PRRAS!C964","v":950},{"$f":"PRRAS!D964","v":0},{"$f":"PRRAS!E964","v":0},0,0,0,0,0]
[151,{"$f":"PRRAS!C965","v":951},{"$f":"PRRAS!D965","v":0},{"$f":"PRRAS!E965","v":0},0,0,0,0,0]
[151,{"$f":"PRRAS!C966","v":952},{"$f":"PRRAS!D966","v":0},{"$f":"PRRAS!E966","v":0},0,0,0,0,0]
[151,{"$f":"PRRAS!C967","v":953},{"$f":"PRRAS!D967","v":0},{"$f":"PRRAS!E967","v":0},0,0,0,0,0]
[151,{"$f":"PRRAS!C968","v":954},{"$f":"PRRAS!D968","v":0},{"$f":"PRRAS!E968","v":0},0,0,0,0,0]
[151,{"$f":"PRRAS!C969","v":955},{"$f":"PRRAS!D969","v":0},{"$f":"PRRAS!E969","v":0},0,0,0,0,0]
[151,{"$f":"PRRAS!C970","v":956},{"$f":"PRRAS!D970","v":0},{"$f":"PRRAS!E970","v":0},0,0,0,0,0]
[151,{"$f":"PRRAS!C971","v":957},{"$f":"PRRAS!D971","v":0},{"$f":"PRRAS!E971","v":0},0,0,0,0,0]
[151,{"$f":"PRRAS!C972","v":958},{"$f":"PRRAS!D972","v":0},{"$f":"PRRAS!E972","v":0},0,0,0,0,0]
[151,{"$f":"PRRAS!C973","v":959},{"$f":"PRRAS!D973","v":0},{"$f":"PRRAS!E973","v":0},0,0,0,0,0]
[151,{"$f":"PRRAS!C974","v":960},{"$f":"PRRAS!D974","v":0},{"$f":"PRRAS!E974","v":0},0,0,0,0,0]
[151,{"$f":"PRRAS!C975","v":961},{"$f":"PRRAS!D975","v":0},{"$f":"PRRAS!E975","v":0},0,0,{"$f":"(B962/1000)*(C962*1+D962*2)","v":0},{"$f":"ABS(C962-ROUND(C962,0))+ABS(D962-ROUND(D962,0))","v":0},0]
[151,{"$f":"PRRAS!C976","v":962},{"$f":"PRRAS!D976","v":0},{"$f":"PRRAS!E976","v":0},0,0,0,0,0]
[151,{"$f":"PRRAS!C977","v":963},{"$f":"PRRAS!D977","v":0},{"$f":"PRRAS!E977","v":0},0,0,0,0,0]
[151,{"$f":"PRRAS!C978","v":964},{"$f":"PRRAS!D978","v":0},{"$f":"PRRAS!E978","v":0},0,0,0,0,0]
[151,{"$f":"PRRAS!C979","v":965},{"$f":"PRRAS!D979","v":0},{"$f":"PRRAS!E979","v":0},0,0,0,0,0]
[151,{"$f":"PRRAS!C980","v":966},{"$f":"PRRAS!D980","v":0},{"$f":"PRRAS!E980","v":0},0,0,0,0,0]
[151,{"$f":"PRRAS!C981","v":967},{"$f":"PRRAS!D981","v":0},{"$f":"PRRAS!E981","v":0},0,0,0,0,0]
[151,{"$f":"PRRAS!C985","v":968},{"$f":"PRRAS!D985","v":0},{"$f":"PRRAS!E985","v":0},0,0,0,0,0]
[151,{"$f":"PRRAS!C986","v":969},{"$f":"PRRAS!D986","v":0},{"$f":"PRRAS!E986","v":0},0,0,0,0,0]
[151,{"$f":"PRRAS!C987","v":970},{"$f":"PRRAS!D987","v":0},{"$f":"PRRAS!E987","v":0},0,0,0,0,0]
[151,{"$f":"PRRAS!C988","v":971},{"$f":"PRRAS!D988","v":0},{"$f":"PRRAS!E988","v":0},0,0,0,0,0]
[151,{"$f":"PRRAS!C989","v":972},{"$f":"PRRAS!D989","v":0},{"$f":"PRRAS!E989","v":0},0,0,0,0,0]
[151,{"$f":"PRRAS!C990","v":973},{"$f":"PRRAS!D990","v":0},{"$f":"PRRAS!E990","v":0},0,0,0,0,0]
[151,{"$f":"PRRAS!C991","v":974},{"$f":"PRRAS!D991","v":0},{"$f":"PRRAS!E991","v":0},0,0,0,0,0]
[151,{"$f":"PRRAS!C992","v":975},{"$f":"PRRAS!D992","v":0},{"$f":"PRRAS!E992","v":0},0,0,0,0,0]
[152,{"$f":"Bil!C12","v":1},{"$f":"Bil!D12","v":834117},{"$f":"Bil!E12","v":877835},0,0,{"$f":"B977/1000*C977+B977/500*D977","v":2589.7870000000003},0]
[152,{"$f":"Bil!C13","v":2},{"$f":"Bil!D13","v":127017},{"$f":"Bil!E13","v":157138},0,0,882.58600000000001,0]
[152,{"$f":"Bil!C14","v":3},{"$f":"Bil!D14","v":0},{"$f":"Bil!E14","v":0},0,0,0,0]
[152,{"$f":"Bil!C15","v":4},{"$f":"Bil!D15","v":0},{"$f":"Bil!E15","v":0},0,0,0,0]
[152,{"$f":"Bil!C16","v":5},{"$f":"Bil!D16","v":0},{"$f":"Bil!E16","v":0},0,0,0,0]
[152,{"$f":"Bil!C17","v":6},{"$f":"Bil!D17","v":0},{"$f":"Bil!E17","v":0},0,0,0,0]
[152,{"$f":"Bil!C18","v":7},{"$f":"Bil!D18","v":127017},{"$f":"Bil!E18","v":157138},0,0,3089.0510000000004,0]
[152,{"$f":"Bil!C19","v":8},{"$f":"Bil!D19","v":0},{"$f":"Bil!E19","v":0},0,0,0,0]
[152,{"$f":"Bil!C20","v":9},{"$f":"Bil!D20","v":0},{"$f":"Bil!E20","v":0},0,0,0,0]
[152,{"$f":"Bil!C21","v":10},{"$f":"Bil!D21","v":0},{"$f":"Bil!E21","v":0},0,0,0,0]
[152,{"$f":"Bil!C22","v":11},{"$f":"Bil!D22","v":0},{"$f":"Bil!E22","v":0},0,0,0,0]
[152,{"$f":"Bil!C23","v":12},{"$f":"Bil!D23","v":0},{"$f":"Bil!E23","v":0},0,0,0,0]
[152,{"$f":"Bil!C24","v":13},{"$f":"Bil!D24","v":0},{"$f":"Bil!E24","v":0},0,0,0,0]
[152,{"$f":"Bil!C25","v":14},{"$f":"Bil!D25","v":111906},{"$f":"Bil!E25","v":142223},0,0,5548.9279999999999,0]
[152,{"$f":"Bil!C26","v":15},{"$f":"Bil!D26","v":1087640},{"$f":"Bil!E26","v":1115357},0,0,49775.31,0]
[152,{"$f":"Bil!C27","v":16},{"$f":"Bil!D27","v":105994},{"$f":"Bil!E27","v":103295},0,0,5001.3440000000001,0]
[152,{"$f":"Bil!C28","v":17},{"$f":"Bil!D28","v":104960},{"$f":"Bil!E28","v":118519},0,0,5813.9660000000003,0]
[152,{"$f":"Bil!C29","v":18},{"$f":"Bil!D29","v":0},{"$f":"Bil!E29","v":0},0,0,0,0]
[152,{"$f":"Bil!C30","v":19},{"$f":"Bil!D30","v":0},{"$f":"Bil!E30","v":0},0,0,0,0]
[152,{"$f":"Bil!C31","v":20},{"$f":"Bil!D31","v":114373},{"$f":"Bil!E31","v":117762},0,0,6997.9400000000005,0]
[152,{"$f":"Bil!C32","v":21},{"$f":"Bil!D32","v":299916},{"$f":"Bil!E32","v":324393},0,0,19922.742000000002,0]
[152,{"$f":"Bil!C33","v":22},{"$f":"Bil!D33","v":0},{"$f":"Bil!E33","v":0},0,0,0,0]
[152,{"$f":"Bil!C34","v":23},{"$f":"Bil!D34","v":1600977},{"$f":"Bil!E34","v":1637103},0,0,112129.209,0]
[152,{"$f":"Bil!C35","v":24},{"$f":"Bil!D35","v":0},{"$f":"Bil!E35","v":0},0,0,0,0]
[152,{"$f":"Bil!C36","v":25},{"$f":"Bil!D36","v":0},{"$f":"Bil!E36","v":0},0,0,0,0]
[152,{"$f":"Bil!C37","v":26},{"$f":"Bil!D37","v":0},{"$f":"Bil!E37","v":0},0,0,0,0]
[152,{"$f":"Bil!C38","v":27},{"$f":"Bil!D38","v":0},{"$f":"Bil!E38","v":0},0,0,0,0]
[152,{"$f":"Bil!C39","v":28},{"$f":"Bil!D39","v":0},{"$f":"Bil!E39","v":0},0,0,0,0]
[152,{"$f":"Bil!C40","v":29},{"$f":"Bil!D40","v":0},{"$f":"Bil!E40","v":0},0,0,0,0]
[152,{"$f":"Bil!C41","v":30},{"$f":"Bil!D41","v":13647},{"$f":"Bil!E41","v":13451},0,0,1216.4699999999998,0]
[152,{"$f":"Bil!C42","v":31},{"$f":"Bil!D42","v":298015},{"$f":"Bil!E42","v":298015},0,0,27715.395,0]
[152,{"$f":"Bil!C43","v":32},{"$f":"Bil!D43","v":0},{"$f":"Bil!E43","v":0},0,0,0,0]
[152,{"$f":"Bil!C44","v":33},{"$f":"Bil!D44","v":0},{"$f":"Bil!E44","v":0},0,0,0,0]
[152,{"$f":"Bil!C45","v":34},{"$f":"Bil!D45","v":0},{"$f":"Bil!E45","v":0},0,0,0,0]
[152,{"$f":"Bil!C46","v":35},{"$f":"Bil!D46","v":284368},{"$f":"Bil!E46","v":284564},0,0,29872.360000000004,0]
[152,{"$f":"Bil!C47","v":36},{"$f":"Bil!D47","v":0},{"$f":"Bil!E47","v":0},0,0,0,0]
[152,{"$f":"Bil!C48","v":37},{"$f":"Bil!D48","v":0},{"$f":"Bil!E48","v":0},0,0,0,0]
[152,{"$f":"Bil!C49","v":38},{"$f":"Bil!D49","v":0},{"$f":"Bil!E49","v":0},0,0,0,0]
[152,{"$f":"Bil!C50","v":39},{"$f":"Bil!D50","v":0},{"$f":"Bil!E50","v":0},0,0,0,0]
[152,{"$f":"Bil!C51","v":40},{"$f":"Bil!D51","v":1464},{"$f":"Bil!E51","v":1464},0,0,175.68,0]
[152,{"$f":"Bil!C52","v":41},{"$f":"Bil!D52","v":0},{"$f":"Bil!E52","v":0},0,0,0,0]
[152,{"$f":"Bil!C53","v":42},{"$f":"Bil!D53","v":1464},{"$f":"Bil!E53","v":1464},0,0,184.46400000000003,0]
[152,{"$f":"Bil!C54","v":43},{"$f":"Bil!D54","v":0},{"$f":"Bil!E54","v":0},0,0,0,0]
[152,{"$f":"Bil!C55","v":44},{"$f":"Bil!D55","v":0},{"$f":"Bil!E55","v":0},0,0,0,0]
[152,{"$f":"Bil!C56","v":45},{"$f":"Bil!D56","v":0},{"$f":"Bil!E56","v":0},0,0,0,0]
[152,{"$f":"Bil!C57","v":46},{"$f":"Bil!D57","v":0},{"$f":"Bil!E57","v":0},0,0,0,0]
[152,{"$f":"Bil!C58","v":47},{"$f":"Bil!D58","v":0},{"$f":"Bil!E58","v":0},0,0,0,0]
[152,{"$f":"Bil!C59","v":48},{"$f":"Bil!D59","v":0},{"$f":"Bil!E59","v":0},0,0,0,0]
[152,{"$f":"Bil!C60","v":49},{"$f":"Bil!D60","v":185752},{"$f":"Bil!E60","v":181014},0,0,26841.22,0]
[152,{"$f":"Bil!C61","v":50},{"$f":"Bil!D61","v":185752},{"$f":"Bil!E61","v":181014},0,0,27389,{"$f":"ABS(C1026-ROUND(C1026,0))+ABS(D1026-ROUND(D1026,0))","v":0}]
[152,{"$f":"Bil!C62","v":51},{"$f":"Bil!D62","v":0},{"$f":"Bil!E62","v":0},0,0,0,0]
[152,{"$f":"Bil!C63","v":52},{"$f":"Bil!D63","v":0},{"$f":"Bil!E63","v":0},0,0,0,0]
[152,{"$f":"Bil!C64","v":53},{"$f":"Bil!D64","v":0},{"$f":"Bil!E64","v":0},0,0,0,0]
[152,{"$f":"Bil!C65","v":54},{"$f":"Bil!D65","v":0},{"$f":"Bil!E65","v":0},0,0,0,0]
[152,{"$f":"Bil!C66","v":55},{"$f":"Bil!D66","v":0},{"$f":"Bil!E66","v":0},0,0,0,0]
[152,{"$f":"Bil!C67","v":56},{"$f":"Bil!D67","v":0},{"$f":"Bil!E67","v":0},0,0,0,0]
[152,{"$f":"Bil!C68","v":57},{"$f":"Bil!D68","v":0},{"$f":"Bil!E68","v":0},0,0,0,0]
[152,{"$f":"Bil!C69","v":58},{"$f":"Bil!D69","v":0},{"$f":"Bil!E69","v":0},0,0,0,0]
[152,{"$f":"Bil!C70","v":59},{"$f":"Bil!D70","v":0},{"$f":"Bil!E70","v":0},0,0,0,0]
[152,{"$f":"Bil!C71","v":60},{"$f":"Bil!D71","v":0},{"$f":"Bil!E71","v":0},0,0,0,0]
[152,{"$f":"Bil!C72","v":61},{"$f":"Bil!D72","v":0},{"$f":"Bil!E72","v":0},0,0,0,0]
[152,{"$f":"Bil!C73","v":62},{"$f":"Bil!D73","v":0},{"$f":"Bil!E73","v":0},0,0,0,0]
[152,{"$f":"Bil!C74","v":63},{"$f":"Bil!D74","v":707100},{"$f":"Bil!E74","v":720697},0,0,135355.122,0]
[152,{"$f":"Bil!C75","v":64},{"$f":"Bil!D75","v":205268},{"$f":"Bil!E75","v":127487},0,0,29455.488000000001,0]
[152,{"$f":"Bil!C76","v":65},{"$f":"Bil!D76","v":204905},{"$f":"Bil!E76","v":126366},0,0,{"$f":"B1041/1000*C1041+B1041/500*D1041","v":29746.405000000002},0]
[152,{"$f":"Bil!C77","v":66},{"$f":"Bil!D77","v":0},{"$f":"Bil!E77","v":0},0,0,0,0]
[152,{"$f":"Bil!C78","v":67},{"$f":"Bil!D78","v":204905},{"$f":"Bil!E78","v":126366},0,0,30661.679000000004,0]
[152,{"$f":"Bil!C79","v":68},{"$f":"Bil!D79","v":0},{"$f":"Bil!E79","v":0},0,0,0,0]
[152,{"$f":"Bil!C80","v":69},{"$f":"Bil!D80","v":0},{"$f":"Bil!E80","v":0},0,0,0,0]
[152,{"$f":"Bil!C81","v":70},{"$f":"Bil!D81","v":0},{"$f":"Bil!E81","v":0},0,0,0,0]
[152,{"$f":"Bil!C82","v":71},{"$f":"Bil!D82","v":363},{"$f":"Bil!E82","v":1121},0,0,184.95499999999998,0]
[152,{"$f":"Bil!C83","v":72},{"$f":"Bil!D83","v":0},{"$f":"Bil!E83","v":0},0,0,0,0]
[152,{"$f":"Bil!C84","v":73},{"$f":"Bil!D84","v":1540},{"$f":"Bil!E84","v":22766},0,0,3436.2559999999999,0]
[152,{"$f":"Bil!C85","v":74},{"$f":"Bil!D85","v":0},{"$f":"Bil!E85","v":0},0,0,0,0]
[152,{"$f":"Bil!C86","v":75},{"$f":"Bil!D86","v":0},{"$f":"Bil!E86","v":0},0,0,0,0]
[152,{"$f":"Bil!C87","v":76},{"$f":"Bil!D87","v":0},{"$f":"Bil!E87","v":0},0,0,0,0]
[152,{"$f":"Bil!C88","v":77},{"$f":"Bil!D88","v":0},{"$f":"Bil!E88","v":0},0,0,0,0]
[152,{"$f":"Bil!C89","v":78},{"$f":"Bil!D89","v":0},{"$f":"Bil!E89","v":0},0,0,0,0]
[152,{"$f":"Bil!C90","v":79},{"$f":"Bil!D90","v":0},{"$f":"Bil!E90","v":0},0,0,0,0]
[152,{"$f":"Bil!C91","v":80},{"$f":"Bil!D91","v":1540},{"$f":"Bil!E91","v":22766},0,0,3765.7599999999998,0]
[152,{"$f":"Bil!C92","v":81},{"$f":"Bil!D92","v":0},{"$f":"Bil!E92","v":0},0,0,0,0]
[152,{"$f":"Bil!C93","v":82},{"$f":"Bil!D93","v":0},{"$f":"Bil!E93","v":0},0,0,0,0]
[152,{"$f":"Bil!C94","v":83},{"$f":"Bil!D94","v":0},{"$f":"Bil!E94","v":0},0,0,0,0]
[152,{"$f":"Bil!C95","v":84},{"$f":"Bil!D95","v":0},{"$f":"Bil!E95","v":0},0,0,0,0]
[152,{"$f":"Bil!C96","v":85},{"$f":"Bil!D96","v":0},{"$f":"Bil!E96","v":0},0,0,0,0]
[152,{"$f":"Bil!C97","v":86},{"$f":"Bil!D97","v":0},{"$f":"Bil!E97","v":0},0,0,0,0]
[152,{"$f":"Bil!C98","v":87},{"$f":"Bil!D98","v":0},{"$f":"Bil!E98","v":0},0,0,0,0]
[152,{"$f":"Bil!C99","v":88},{"$f":"Bil!D99","v":0},{"$f":"Bil!E99","v":0},0,0,0,0]
[152,{"$f":"Bil!C100","v":89},{"$f":"Bil!D100","v":0},{"$f":"Bil!E100","v":0},0,0,0,0]
[152,{"$f":"Bil!C101","v":90},{"$f":"Bil!D101","v":0},{"$f":"Bil!E101","v":0},0,0,0,0]
[152,{"$f":"Bil!C102","v":91},{"$f":"Bil!D102","v":0},{"$f":"Bil!E102","v":0},0,0,0,0]
[152,{"$f":"Bil!C103","v":92},{"$f":"Bil!D103","v":0},{"$f":"Bil!E103","v":0},0,0,0,0]
[152,{"$f":"Bil!C104","v":93},{"$f":"Bil!D104","v":0},{"$f":"Bil!E104","v":0},0,0,0,0]
[152,{"$f":"Bil!C105","v":94},{"$f":"Bil!D105","v":0},{"$f":"Bil!E105","v":0},0,0,0,0]
[152,{"$f":"Bil!C106","v":95},{"$f":"Bil!D106","v":0},{"$f":"Bil!E106","v":0},0,0,0,0]
[152,{"$f":"Bil!C107","v":96},{"$f":"Bil!D107","v":0},{"$f":"Bil!E107","v":0},0,0,0,0]
[152,{"$f":"Bil!C108","v":97},{"$f":"Bil!D108","v":0},{"$f":"Bil!E108","v":0},0,0,0,0]
[152,{"$f":"Bil!C109","v":98},{"$f":"Bil!D109","v":0},{"$f":"Bil!E109","v":0},0,0,0,0]
[152,{"$f":"Bil!C110","v":99},{"$f":"Bil!D110","v":0},{"$f":"Bil!E110","v":0},0,0,0,0]
[152,{"$f":"Bil!C111","v":100},{"$f":"Bil!D111","v":0},{"$f":"Bil!E111","v":0},0,0,0,0]
[152,{"$f":"Bil!C112","v":101},{"$f":"Bil!D112","v":0},{"$f":"Bil!E112","v":0},0,0,0,0]
[152,{"$f":"Bil!C113","v":102},{"$f":"Bil!D113","v":0},{"$f":"Bil!E113","v":0},0,0,0,0]
[152,{"$f":"Bil!C114","v":103},{"$f":"Bil!D114","v":0},{"$f":"Bil!E114","v":0},0,0,0,0]
[152,{"$f":"Bil!C115","v":104},{"$f":"Bil!D115","v":0},{"$f":"Bil!E115","v":0},0,0,0,0]
[152,{"$f":"Bil!C116","v":105},{"$f":"Bil!D116","v":0},{"$f":"Bil!E116","v":0},0,0,0,0]
[152,{"$f":"Bil!C117","v":106},{"$f":"Bil!D117","v":0},{"$f":"Bil!E117","v":0},0,0,0,0]
[152,{"$f":"Bil!C118","v":107},{"$f":"Bil!D118","v":0},{"$f":"Bil!E118","v":0},0,0,0,0]
[152,{"$f":"Bil!C119","v":108},{"$f":"Bil!D119","v":0},{"$f":"Bil!E119","v":0},0,0,0,0]
[152,{"$f":"Bil!C120","v":109},{"$f":"Bil!D120","v":0},{"$f":"Bil!E120","v":0},0,0,0,0]
[152,{"$f":"Bil!C121","v":110},{"$f":"Bil!D121","v":0},{"$f":"Bil!E121","v":0},0,0,0,0]
[152,{"$f":"Bil!C122","v":111},{"$f":"Bil!D122","v":0},{"$f":"Bil!E122","v":0},0,0,0,0]
[152,{"$f":"Bil!C123","v":112},{"$f":"Bil!D123","v":0},{"$f":"Bil!E123","v":0},0,0,0,0]
[152,{"$f":"Bil!C124","v":113},{"$f":"Bil!D124","v":0},{"$f":"Bil!E124","v":0},0,0,0,0]
[152,{"$f":"Bil!C125","v":114},{"$f":"Bil!D125","v":0},{"$f":"Bil!E125","v":0},0,0,0,{"$f":"ABS(C1090-ROUND(C1090,0))+ABS(D1090-ROUND(D1090,0))","v":0}]
[152,{"$f":"Bil!C126","v":115},{"$f":"Bil!D126","v":0},{"$f":"Bil!E126","v":0},0,0,0,0]
[152,{"$f":"Bil!C127","v":116},{"$f":"Bil!D127","v":0},{"$f":"Bil!E127","v":0},0,0,0,0]
[152,{"$f":"Bil!C128","v":117},{"$f":"Bil!D128","v":0},{"$f":"Bil!E128","v":0},0,0,0,0]
[152,{"$f":"Bil!C129","v":118},{"$f":"Bil!D129","v":0},{"$f":"Bil!E129","v":0},0,0,0,0]
[152,{"$f":"Bil!C130","v":119},{"$f":"Bil!D130","v":0},{"$f":"Bil!E130","v":0},0,0,0,0]
[152,{"$f":"Bil!C131","v":120},{"$f":"Bil!D131","v":0},{"$f":"Bil!E131","v":0},0,0,0,0]
[152,{"$f":"Bil!C132","v":121},{"$f":"Bil!D132","v":0},{"$f":"Bil!E132","v":0},0,0,0,0]
[152,{"$f":"Bil!C133","v":122},{"$f":"Bil!D133","v":0},{"$f":"Bil!E133","v":0},0,0,0,0]
[152,{"$f":"Bil!C134","v":123},{"$f":"Bil!D134","v":0},{"$f":"Bil!E134","v":0},0,0,0,0]
[152,{"$f":"Bil!C135","v":124},{"$f":"Bil!D135","v":0},{"$f":"Bil!E135","v":0},0,0,0,0]
[152,{"$f":"Bil!C136","v":125},{"$f":"Bil!D136","v":0},{"$f":"Bil!E136","v":0},0,0,0,0]
[152,{"$f":"Bil!C137","v":126},{"$f":"Bil!D137","v":0},{"$f":"Bil!E137","v":0},0,0,0,0]
[152,{"$f":"Bil!C138","v":127},{"$f":"Bil!D138","v":0},{"$f":"Bil!E138","v":0},0,0,0,0]
[152,{"$f":"Bil!C139","v":128},{"$f":"Bil!D139","v":0},{"$f":"Bil!E139","v":0},0,0,0,0]
[152,{"$f":"Bil!C140","v":129},{"$f":"Bil!D140","v":0},{"$f":"Bil!E140","v":0},0,0,{"$f":"B1105/1000*C1105+B1105/500*D1105","v":0},0]
[152,{"$f":"Bil!C141","v":130},{"$f":"Bil!D141","v":0},{"$f":"Bil!E141","v":0},0,0,0,0]
[152,{"$f":"Bil!C142","v":131},{"$f":"Bil!D142","v":0},{"$f":"Bil!E142","v":0},0,0,0,0]
[152,{"$f":"Bil!C143","v":132},{"$f":"Bil!D143","v":0},{"$f":"Bil!E143","v":0},0,0,0,0]
[152,{"$f":"Bil!C144","v":133},{"$f":"Bil!D144","v":0},{"$f":"Bil!E144","v":0},0,0,0,0]
[152,{"$f":"Bil!C145","v":134},{"$f":"Bil!D145","v":0},{"$f":"Bil!E145","v":0},0,0,0,0]
[152,{"$f":"Bil!C146","v":135},{"$f":"Bil!D146","v":0},{"$f":"Bil!E146","v":0},0,0,0,0]
[152,{"$f":"Bil!C147","v":136},{"$f":"Bil!D147","v":0},{"$f":"Bil!E147","v":0},0,0,0,0]
[152,{"$f":"Bil!C148","v":137},{"$f":"Bil!D148","v":0},{"$f":"Bil!E148","v":0},0,0,0,0]
[152,{"$f":"Bil!C149","v":138},{"$f":"Bil!D149","v":0},{"$f":"Bil!E149","v":0},0,0,0,0]
[152,{"$f":"Bil!C150","v":139},{"$f":"Bil!D150","v":0},{"$f":"Bil!E150","v":0},0,0,0,0]
[152,{"$f":"Bil!C151","v":140},{"$f":"Bil!D151","v":7258},{"$f":"Bil!E151","v":8943},0,0,3520.1600000000008,0]
[152,{"$f":"Bil!C152","v":141},{"$f":"Bil!D152","v":0},{"$f":"Bil!E152","v":0},0,0,0,0]
[152,{"$f":"Bil!C153","v":142},{"$f":"Bil!D153","v":0},{"$f":"Bil!E153","v":0},0,0,0,0]
[152,{"$f":"Bil!C154","v":143},{"$f":"Bil!D154","v":0},{"$f":"Bil!E154","v":0},0,0,0,0]
[152,{"$f":"Bil!C155","v":144},{"$f":"Bil!D155","v":0},{"$f":"Bil!E155","v":0},0,0,0,0]
[152,{"$f":"Bil!C156","v":145},{"$f":"Bil!D156","v":0},{"$f":"Bil!E156","v":0},0,0,0,0]
[152,{"$f":"Bil!C157","v":146},{"$f":"Bil!D157","v":0},{"$f":"Bil!E157","v":0},0,0,0,0]
[152,{"$f":"Bil!C158","v":147},{"$f":"Bil!D158","v":0},{"$f":"Bil!E158","v":0},0,0,0,0]
[152,{"$f":"Bil!C159","v":148},{"$f":"Bil!D159","v":0},{"$f":"Bil!E159","v":0},0,0,0,0]
[152,{"$f":"Bil!C160","v":149},{"$f":"Bil!D160","v":0},{"$f":"Bil!E160","v":0},0,0,0,0]
[152,{"$f":"Bil!C161","v":150},{"$f":"Bil!D161","v":0},{"$f":"Bil!E161","v":0},0,0,0,0]
[152,{"$f":"Bil!C162","v":151},{"$f":"Bil!D162","v":0},{"$f":"Bil!E162","v":0},0,0,0,0]
[152,{"$f":"Bil!C163","v":152},{"$f":"Bil!D163","v":0},{"$f":"Bil!E163","v":0},0,0,0,0]
[152,{"$f":"Bil!C164","v":153},{"$f":"Bil!D164","v":7258},{"$f":"Bil!E164","v":8943},0,0,3847.0320000000002,0]
[152,{"$f":"Bil!C165","v":154},{"$f":"Bil!D165","v":0},{"$f":"Bil!E165","v":0},0,0,0,0]
[152,{"$f":"Bil!C166","v":155},{"$f":"Bil!D166","v":0},{"$f":"Bil!E166","v":0},0,0,0,0]
[152,{"$f":"Bil!C167","v":156},{"$f":"Bil!D167","v":0},{"$f":"Bil!E167","v":0},0,0,0,0]
[152,{"$f":"Bil!C168","v":157},{"$f":"Bil!D168","v":0},{"$f":"Bil!E168","v":0},0,0,0,0]
[152,{"$f":"Bil!C169","v":158},{"$f":"Bil!D169","v":493034},{"$f":"Bil!E169","v":561501},0,0,255333.68799999999,0]
[152,{"$f":"Bil!C170","v":159},{"$f":"Bil!D170","v":0},{"$f":"Bil!E170","v":0},0,0,0,0]
[152,{"$f":"Bil!C171","v":160},{"$f":"Bil!D171","v":0},{"$f":"Bil!E171","v":0},0,0,0,0]
[152,{"$f":"Bil!C172","v":161},{"$f":"Bil!D172","v":493034},{"$f":"Bil!E172","v":561501},0,0,260181.79600000003,0]
[152,{"$f":"Bil!C173","v":162},{"$f":"Bil!D173","v":834116},{"$f":"Bil!E173","v":877834},0,0,419545.00800000003,0]
[152,{"$f":"Bil!C174","v":163},{"$f":"Bil!D174","v":613897},{"$f":"Bil!E174","v":699199},0,0,328004.08500000002,0]
[152,{"$f":"Bil!C175","v":164},{"$f":"Bil!D175","v":597788},{"$f":"Bil!E175","v":691521},0,0,324856.12,0]
[152,{"$f":"Bil!C176","v":165},{"$f":"Bil!D176","v":484295},{"$f":"Bil!E176","v":558273},0,0,264138.76500000001,0]
[152,{"$f":"Bil!C177","v":166},{"$f":"Bil!D177","v":111158},{"$f":"Bil!E177","v":118222},0,0,57701.932000000001,0]
[152,{"$f":"Bil!C178","v":167},{"$f":"Bil!D178","v":795},{"$f":"Bil!E178","v":125},0,0,174.51500000000001,0]
[152,{"$f":"Bil!C179","v":168},{"$f":"Bil!D179","v":0},{"$f":"Bil!E179","v":0},0,0,0,0]
[152,{"$f":"Bil!C180","v":169},{"$f":"Bil!D180","v":0},{"$f":"Bil!E180","v":0},0,0,0,0]
[152,{"$f":"Bil!C181","v":170},{"$f":"Bil!D181","v":795},{"$f":"Bil!E181","v":125},0,0,177.65,0]
[152,{"$f":"Bil!C182","v":171},{"$f":"Bil!D182","v":0},{"$f":"Bil!E182","v":0},0,0,0,0]
[152,{"$f":"Bil!C183","v":172},{"$f":"Bil!D183","v":0},{"$f":"Bil!E183","v":0},0,0,0,0]
[152,{"$f":"Bil!C184","v":173},{"$f":"Bil!D184","v":0},{"$f":"Bil!E184","v":0},0,0,0,0]
[152,{"$f":"Bil!C185","v":174},{"$f":"Bil!D185","v":1540},{"$f":"Bil!E185","v":14901},0,0,5453.5079999999998,0]
[152,{"$f":"Bil!C186","v":175},{"$f":"Bil!D186","v":0},{"$f":"Bil!E186","v":0},0,0,0,0]
[152,{"$f":"Bil!C187","v":176},{"$f":"Bil!D187","v":0},{"$f":"Bil!E187","v":0},0,0,0,0]
[152,{"$f":"Bil!C188","v":177},{"$f":"Bil!D188","v":0},{"$f":"Bil!E188","v":0},0,0,0,0]
[152,{"$f":"Bil!C189","v":178},{"$f":"Bil!D189","v":0},{"$f":"Bil!E189","v":0},0,0,0,{"$f":"ABS(C1154-ROUND(C1154,0))+ABS(D1154-ROUND(D1154,0))","v":0}]
[152,{"$f":"Bil!C190","v":179},{"$f":"Bil!D190","v":0},{"$f":"Bil!E190","v":0},0,0,0,0]
[152,{"$f":"Bil!C191","v":180},{"$f":"Bil!D191","v":0},{"$f":"Bil!E191","v":0},0,0,0,0]
[152,{"$f":"Bil!C192","v":181},{"$f":"Bil!D192","v":0},{"$f":"Bil!E192","v":0},0,0,0,0]
[152,{"$f":"Bil!C193","v":182},{"$f":"Bil!D193","v":0},{"$f":"Bil!E193","v":0},0,0,0,0]
[152,{"$f":"Bil!C194","v":183},{"$f":"Bil!D194","v":0},{"$f":"Bil!E194","v":0},0,0,0,0]
[152,{"$f":"Bil!C195","v":184},{"$f":"Bil!D195","v":0},{"$f":"Bil!E195","v":0},0,0,0,0]
[152,{"$f":"Bil!C196","v":185},{"$f":"Bil!D196","v":0},{"$f":"Bil!E196","v":0},0,0,0,0]
[152,{"$f":"Bil!C197","v":186},{"$f":"Bil!D197","v":0},{"$f":"Bil!E197","v":0},0,0,0,0]
[152,{"$f":"Bil!C198","v":187},{"$f":"Bil!D198","v":0},{"$f":"Bil!E198","v":0},0,0,0,0]
[152,{"$f":"Bil!C199","v":188},{"$f":"Bil!D199","v":0},{"$f":"Bil!E199","v":0},0,0,0,0]
[152,{"$f":"Bil!C200","v":189},{"$f":"Bil!D200","v":0},{"$f":"Bil!E200","v":0},0,0,0,0]
[152,{"$f":"Bil!C201","v":190},{"$f":"Bil!D201","v":0},{"$f":"Bil!E201","v":0},0,0,0,0]
[152,{"$f":"Bil!C202","v":191},{"$f":"Bil!D202","v":0},{"$f":"Bil!E202","v":0},0,0,0,0]
[152,{"$f":"Bil!C203","v":192},{"$f":"Bil!D203","v":0},{"$f":"Bil!E203","v":0},0,0,0,0]
[152,{"$f":"Bil!C204","v":193},{"$f":"Bil!D204","v":0},{"$f":"Bil!E204","v":0},0,0,{"$f":"B1169/1000*C1169+B1169/500*D1169","v":0},0]
[152,{"$f":"Bil!C205","v":194},{"$f":"Bil!D205","v":0},{"$f":"Bil!E205","v":0},0,0,0,0]
[152,{"$f":"Bil!C206","v":195},{"$f":"Bil!D206","v":0},{"$f":"Bil!E206","v":0},0,0,0,0]
[152,{"$f":"Bil!C207","v":196},{"$f":"Bil!D207","v":0},{"$f":"Bil!E207","v":0},0,0,0,0]
[152,{"$f":"Bil!C208","v":197},{"$f":"Bil!D208","v":0},{"$f":"Bil!E208","v":0},0,0,0,0]
[152,{"$f":"Bil!C209","v":198},{"$f":"Bil!D209","v":0},{"$f":"Bil!E209","v":0},0,0,0,0]
[152,{"$f":"Bil!C210","v":199},{"$f":"Bil!D210","v":0},{"$f":"Bil!E210","v":0},0,0,0,0]
[152,{"$f":"Bil!C211","v":200},{"$f":"Bil!D211","v":0},{"$f":"Bil!E211","v":0},0,0,0,0]
[152,{"$f":"Bil!C212","v":201},{"$f":"Bil!D212","v":0},{"$f":"Bil!E212","v":0},0,0,0,0]
[152,{"$f":"Bil!C213","v":202},{"$f":"Bil!D213","v":0},{"$f":"Bil!E213","v":0},0,0,0,0]
[152,{"$f":"Bil!C214","v":203},{"$f":"Bil!D214","v":0},{"$f":"Bil!E214","v":0},0,0,0,0]
[152,{"$f":"Bil!C215","v":204},{"$f":"Bil!D215","v":0},{"$f":"Bil!E215","v":0},0,0,0,0]
[152,{"$f":"Bil!C216","v":205},{"$f":"Bil!D216","v":0},{"$f":"Bil!E216","v":0},0,0,0,0]
[152,{"$f":"Bil!C217","v":206},{"$f":"Bil!D217","v":0},{"$f":"Bil!E217","v":0},0,0,0,0]
[152,{"$f":"Bil!C218","v":207},{"$f":"Bil!D218","v":0},{"$f":"Bil!E218","v":0},0,0,0,0]
[152,{"$f":"Bil!C219","v":208},{"$f":"Bil!D219","v":0},{"$f":"Bil!E219","v":0},0,0,0,0]
[152,{"$f":"Bil!C220","v":209},{"$f":"Bil!D220","v":0},{"$f":"Bil!E220","v":0},0,0,0,0]
[152,{"$f":"Bil!C221","v":210},{"$f":"Bil!D221","v":0},{"$f":"Bil!E221","v":0},0,0,0,0]
[152,{"$f":"Bil!C222","v":211},{"$f":"Bil!D222","v":0},{"$f":"Bil!E222","v":0},0,0,0,0]
[152,{"$f":"Bil!C223","v":212},{"$f":"Bil!D223","v":0},{"$f":"Bil!E223","v":0},0,0,0,0]
[152,{"$f":"Bil!C224","v":213},{"$f":"Bil!D224","v":0},{"$f":"Bil!E224","v":0},0,0,0,0]
[152,{"$f":"Bil!C225","v":214},{"$f":"Bil!D225","v":0},{"$f":"Bil!E225","v":0},0,0,0,0]
[152,{"$f":"Bil!C226","v":215},{"$f":"Bil!D226","v":0},{"$f":"Bil!E226","v":0},0,0,0,0]
[152,{"$f":"Bil!C227","v":216},{"$f":"Bil!D227","v":0},{"$f":"Bil!E227","v":0},0,0,0,0]
[152,{"$f":"Bil!C228","v":217},{"$f":"Bil!D228","v":0},{"$f":"Bil!E228","v":0},0,0,0,0]
[152,{"$f":"Bil!C229","v":218},{"$f":"Bil!D229","v":0},{"$f":"Bil!E229","v":0},0,0,0,0]
[152,{"$f":"Bil!C230","v":219},{"$f":"Bil!D230","v":0},{"$f":"Bil!E230","v":0},0,0,0,0]
[152,{"$f":"Bil!C231","v":220},{"$f":"Bil!D231","v":16109},{"$f":"Bil!E231","v":7678},0,0,6922.3,0]
[152,{"$f":"Bil!C232","v":221},{"$f":"Bil!D232","v":0},{"$f":"Bil!E232","v":0},0,0,0,0]
[152,{"$f":"Bil!C233","v":222},{"$f":"Bil!D233","v":16109},{"$f":"Bil!E233","v":7678},0,0,6985.23,0]
[152,{"$f":"Bil!C234","v":223},{"$f":"Bil!D234","v":220219},{"$f":"Bil!E234","v":178635},0,0,128780.04700000001,0]
[152,{"$f":"Bil!C235","v":224},{"$f":"Bil!D235","v":127017},{"$f":"Bil!E235","v":157142},0,0,98851.423999999999,0]
[152,{"$f":"Bil!C236","v":225},{"$f":"Bil!D236","v":127017},{"$f":"Bil!E236","v":157142},0,0,99292.725000000006,0]
[152,{"$f":"Bil!C237","v":226},{"$f":"Bil!D237","v":127017},{"$f":"Bil!E237","v":157142},0,0,99734.026000000013,0]
[152,{"$f":"Bil!C238","v":227},{"$f":"Bil!D238","v":0},{"$f":"Bil!E238","v":0},0,0,0,0]
[152,{"$f":"Bil!C239","v":228},{"$f":"Bil!D239","v":0},{"$f":"Bil!E239","v":0},0,0,0,0]
[152,{"$f":"Bil!C240","v":229},{"$f":"Bil!D240","v":0},{"$f":"Bil!E240","v":0},0,0,0,0]
[152,{"$f":"Bil!C241","v":230},{"$f":"Bil!D241","v":0},{"$f":"Bil!E241","v":0},0,0,0,0]
[152,{"$f":"Bil!C242","v":231},{"$f":"Bil!D242","v":0},{"$f":"Bil!E242","v":0},0,0,0,0]
[152,{"$f":"Bil!C243","v":232},{"$f":"Bil!D243","v":85944},{"$f":"Bil!E243","v":12550},0,0,25762.208000000002,0]
[152,{"$f":"Bil!C244","v":233},{"$f":"Bil!D244","v":85944},{"$f":"Bil!E244","v":12550},0,0,25873.252,0]
[152,{"$f":"Bil!C245","v":234},{"$f":"Bil!D245","v":0},{"$f":"Bil!E245","v":0},0,0,0,0]
[152,{"$f":"Bil!C246","v":235},{"$f":"Bil!D246","v":0},{"$f":"Bil!E246","v":0},0,0,0,0]
[152,{"$f":"Bil!C247","v":236},{"$f":"Bil!D247","v":0},{"$f":"Bil!E247","v":0},0,0,0,0]
[152,{"$f":"Bil!C248","v":237},{"$f":"Bil!D248","v":0},{"$f":"Bil!E248","v":0},0,0,0,0]
[152,{"$f":"Bil!C249","v":238},{"$f":"Bil!D249","v":0},{"$f":"Bil!E249","v":0},0,0,0,0]
[152,{"$f":"Bil!C250","v":239},{"$f":"Bil!D250","v":0},{"$f":"Bil!E250","v":0},0,0,0,0]
[152,{"$f":"Bil!C251","v":240},{"$f":"Bil!D251","v":7258},{"$f":"Bil!E251","v":8943},0,0,6034.5599999999995,0]
[152,{"$f":"Bil!C252","v":241},{"$f":"Bil!D252","v":0},{"$f":"Bil!E252","v":0},0,0,0,0]
[152,{"$f":"Bil!C253","v":242},{"$f":"Bil!D253","v":0},{"$f":"Bil!E253","v":0},0,0,0,{"$f":"ABS(C1218-ROUND(C1218,0))+ABS(D1218-ROUND(D1218,0))","v":0}]
[152,{"$f":"Bil!C254","v":243},{"$f":"Bil!D254","v":0},{"$f":"Bil!E254","v":0},0,0,0,0]
[152,{"$f":"Bil!C255","v":244},{"$f":"Bil!D255","v":0},{"$f":"Bil!E255","v":0},0,0,0,0]
[152,{"$f":"Bil!C256","v":245},{"$f":"Bil!D256","v":0},{"$f":"Bil!E256","v":0},0,0,0,0]
[152,{"$f":"Bil!C258","v":246},{"$f":"Bil!D258","v":0},{"$f":"Bil!E258","v":0},0,0,0,0]
[152,{"$f":"Bil!C259","v":247},{"$f":"Bil!D259","v":0},{"$f":"Bil!E259","v":0},0,0,0,0]
[152,{"$f":"Bil!C260","v":248},{"$f":"Bil!D260","v":0},{"$f":"Bil!E260","v":0},0,0,0,0]
[152,{"$f":"Bil!C261","v":249},{"$f":"Bil!D261","v":7258},{"$f":"Bil!E261","v":8943},0,0,6260.8559999999998,0]
[152,{"$f":"Bil!C262","v":250},{"$f":"Bil!D262","v":0},{"$f":"Bil!E262","v":0},0,0,0,0]
[152,{"$f":"Bil!C263","v":251},{"$f":"Bil!D263","v":0},{"$f":"Bil!E263","v":0},0,0,0,0]
[152,{"$f":"Bil!C264","v":252},{"$f":"Bil!D264","v":0},{"$f":"Bil!E264","v":23227},0,0,11706.407999999999,0]
[152,{"$f":"Bil!C265","v":253},{"$f":"Bil!D265","v":0},{"$f":"Bil!E265","v":0},0,0,0,0]
[152,{"$f":"Bil!C266","v":254},{"$f":"Bil!D266","v":0},{"$f":"Bil!E266","v":0},0,0,0,0]
[152,{"$f":"Bil!C267","v":255},{"$f":"Bil!D267","v":0},{"$f":"Bil!E267","v":125},0,0,63.75,0]
[152,{"$f":"Bil!C268","v":256},{"$f":"Bil!D268","v":0},{"$f":"Bil!E268","v":0},0,0,0,0]
[152,{"$f":"Bil!C269","v":257},{"$f":"Bil!D269","v":0},{"$f":"Bil!E269","v":0},0,0,{"$f":"B1233/1000*C1233+B1233/500*D1233","v":0},0]
[152,{"$f":"Bil!C270","v":258},{"$f":"Bil!D270","v":0},{"$f":"Bil!E270","v":0},0,0,0,0]
[152,{"$f":"Bil!C271","v":259},{"$f":"Bil!D271","v":0},{"$f":"Bil!E271","v":0},0,0,0,0]
[152,{"$f":"Bil!C272","v":260},{"$f":"Bil!D272","v":0},{"$f":"Bil!E272","v":0},0,0,0,0]
[152,{"$f":"Bil!C273","v":261},{"$f":"Bil!D273","v":0},{"$f":"Bil!E273","v":0},0,0,0,0]
[152,{"$f":"Bil!C274","v":262},{"$f":"Bil!D274","v":0},{"$f":"Bil!E274","v":0},0,0,0,0]
[152,{"$f":"Bil!C275","v":263},{"$f":"Bil!D275","v":0},{"$f":"Bil!E275","v":0},0,0,0,0]
[152,{"$f":"Bil!C276","v":264},{"$f":"Bil!D276","v":0},{"$f":"Bil!E276","v":0},0,0,0,0]
[152,{"$f":"Bil!C277","v":265},{"$f":"Bil!D277","v":0},{"$f":"Bil!E277","v":0},0,0,0,0]
[152,{"$f":"Bil!C278","v":266},{"$f":"Bil!D278","v":0},{"$f":"Bil!E278","v":0},0,0,0,0]
[152,{"$f":"Bil!C279","v":267},{"$f":"Bil!D279","v":0},{"$f":"Bil!E279","v":0},0,0,0,0]
[152,{"$f":"Bil!C280","v":268},{"$f":"Bil!D280","v":0},{"$f":"Bil!E280","v":0},0,0,0,0]
[152,{"$f":"Bil!C281","v":269},{"$f":"Bil!D281","v":0},{"$f":"Bil!E281","v":0},0,0,0,0]
[152,{"$f":"Bil!C282","v":270},{"$f":"Bil!D282","v":0},{"$f":"Bil!E282","v":0},0,0,0,0]
[152,{"$f":"Bil!C283","v":271},{"$f":"Bil!D283","v":0},{"$f":"Bil!E283","v":0},0,0,0,0]
[152,{"$f":"Bil!C284","v":272},{"$f":"Bil!D284","v":0},{"$f":"Bil!E284","v":0},0,0,0,0]
[152,{"$f":"Bil!C285","v":273},{"$f":"Bil!D285","v":0},{"$f":"Bil!E285","v":0},0,0,0,0]
[152,{"$f":"Bil!C286","v":274},{"$f":"Bil!D286","v":0},{"$f":"Bil!E286","v":0},0,0,0,0]
[152,{"$f":"Bil!C287","v":275},{"$f":"Bil!D287","v":597788},{"$f":"Bil!E287","v":691521},0,0,544728.25,0]
[152,{"$f":"Bil!C288","v":276},{"$f":"Bil!D288","v":0},{"$f":"Bil!E288","v":0},0,0,0,0]
[152,{"$f":"Bil!C289","v":277},{"$f":"Bil!D289","v":0},{"$f":"Bil!E289","v":0},0,0,0,0]
[152,{"$f":"Bil!C290","v":278},{"$f":"Bil!D290","v":0},{"$f":"Bil!E290","v":0},0,0,0,0]
[152,{"$f":"Bil!C291","v":279},{"$f":"Bil!D291","v":0},{"$f":"Bil!E291","v":0},0,0,0,0]
[152,{"$f":"Bil!C292","v":280},{"$f":"Bil!D292","v":0},{"$f":"Bil!E292","v":0},0,0,0,0]
[152,{"$f":"Bil!C293","v":281},{"$f":"Bil!D293","v":0},{"$f":"Bil!E293","v":0},0,0,0,0]
[152,{"$f":"Bil!C294","v":282},{"$f":"Bil!D294","v":0},{"$f":"Bil!E294","v":0},0,0,0,0]
[152,{"$f":"Bil!C295","v":283},{"$f":"Bil!D295","v":0},{"$f":"Bil!E295","v":0},0,0,0,0]
[152,{"$f":"Bil!C296","v":284},{"$f":"Bil!D296","v":0},{"$f":"Bil!E296","v":0},0,0,0,0]
[152,{"$f":"Bil!C297","v":285},{"$f":"Bil!D297","v":0},{"$f":"Bil!E297","v":0},0,0,0,0]
[152,{"$f":"Bil!C298","v":286},{"$f":"Bil!D298","v":0},{"$f":"Bil!E298","v":0},0,0,0,0]
[152,{"$f":"Bil!C299","v":287},{"$f":"Bil!D299","v":0},{"$f":"Bil!E299","v":0},0,0,0,0]
[152,{"$f":"Bil!C300","v":288},{"$f":"Bil!D300","v":0},{"$f":"Bil!E300","v":0},0,0,0,0]
[152,{"$f":"Bil!C301","v":289},{"$f":"Bil!D301","v":0},{"$f":"Bil!E301","v":0},0,0,0,0]
[152,{"$f":"Bil!C302","v":290},{"$f":"Bil!D302","v":1540},{"$f":"Bil!E302","v":14901},0,0,9089.18,0]
[152,{"$f":"Bil!C303","v":291},{"$f":"Bil!D303","v":0},{"$f":"Bil!E303","v":0},0,0,0,0]
[152,{"$f":"Bil!C304","v":292},{"$f":"Bil!D304","v":0},{"$f":"Bil!E304","v":0},0,0,0,0]
[152,{"$f":"Bil!C305","v":293},{"$f":"Bil!D305","v":0},{"$f":"Bil!E305","v":0},0,0,0,0]
[152,{"$f":"Bil!C306","v":294},{"$f":"Bil!D306","v":0},{"$f":"Bil!E306","v":0},0,0,0,0]
[152,{"$f":"Bil!C307","v":295},{"$f":"Bil!D307","v":0},{"$f":"Bil!E307","v":0},0,0,0,0]
[152,{"$f":"Bil!C308","v":296},{"$f":"Bil!D308","v":0},{"$f":"Bil!E308","v":0},0,0,0,0]
[152,{"$f":"Bil!C309","v":297},{"$f":"Bil!D309","v":0},{"$f":"Bil!E309","v":0},0,0,0,0]
[152,{"$f":"Bil!C310","v":298},{"$f":"Bil!D310","v":0},{"$f":"Bil!E310","v":0},0,0,0,0]
[152,{"$f":"Bil!C311","v":299},{"$f":"Bil!D311","v":0},{"$f":"Bil!E311","v":0},0,0,0,0]
[152,{"$f":"Bil!C312","v":300},{"$f":"Bil!D312","v":0},{"$f":"Bil!E312","v":0},0,0,0,0]
[152,{"$f":"Bil!C313","v":301},{"$f":"Bil!D313","v":0},{"$f":"Bil!E313","v":0},0,0,0,0]
[152,{"$f":"Bil!C314","v":302},{"$f":"Bil!D314","v":0},{"$f":"Bil!E314","v":0},0,0,0,0]
[152,{"$f":"Bil!C315","v":303},{"$f":"Bil!D315","v":0},{"$f":"Bil!E315","v":0},0,0,0,0]
[152,{"$f":"Bil!C316","v":304},{"$f":"Bil!D316","v":0},{"$f":"Bil!E316","v":0},0,0,0,0]
[152,{"$f":"Bil!C317","v":305},{"$f":"Bil!D317","v":0},{"$f":"Bil!E317","v":0},0,0,0,0]
[152,{"$f":"Bil!C318","v":306},{"$f":"Bil!D318","v":0},{"$f":"Bil!E318","v":0},0,0,0,{"$f":"ABS(C1282-ROUND(C1282,0))+ABS(D1282-ROUND(D1282,0))","v":0}]
[152,{"$f":"Bil!C319","v":307},{"$f":"Bil!D319","v":0},{"$f":"Bil!E319","v":0},0,0,0,0]
[152,{"$f":"Bil!C320","v":308},{"$f":"Bil!D320","v":0},{"$f":"Bil!E320","v":0},0,0,0,0]
[152,{"$f":"Bil!C321","v":309},{"$f":"Bil!D321","v":0},{"$f":"Bil!E321","v":0},0,0,0,0]
[152,{"$f":"Bil!C322","v":310},{"$f":"Bil!D322","v":0},{"$f":"Bil!E322","v":0},0,0,0,0]
[154,{"$f":"RasF!C12","v":1},{"$f":"RasF!D12","v":0},{"$f":"RasF!E12","v":0},0,0,0,0]
[154,{"$f":"RasF!C13","v":2},{"$f":"RasF!D13","v":0},{"$f":"RasF!E13","v":0},0,0,0,0]
[154,{"$f":"RasF!C14","v":3},{"$f":"RasF!D14","v":0},{"$f":"RasF!E14","v":0},0,0,0,0]
[154,{"$f":"RasF!C15","v":4},{"$f":"RasF!D15","v":0},{"$f":"RasF!E15","v":0},0,0,0,0]
[154,{"$f":"RasF!C16","v":5},{"$f":"RasF!D16","v":0},{"$f":"RasF!E16","v":0},0,0,0,0]
[154,{"$f":"RasF!C17","v":6},{"$f":"RasF!D17","v":0},{"$f":"RasF!E17","v":0},0,0,0,0]
[154,{"$f":"RasF!C18","v":7},{"$f":"RasF!D18","v":0},{"$f":"RasF!E18","v":0},0,0,0,0]
[154,{"$f":"RasF!C19","v":8},{"$f":"RasF!D19","v":0},{"$f":"RasF!E19","v":0},0,0,0,0]
[154,{"$f":"RasF!C20","v":9},{"$f":"RasF!D20","v":0},{"$f":"RasF!E20","v":0},0,0,0,0]
[154,{"$f":"RasF!C21","v":10},{"$f":"RasF!D21","v":0},{"$f":"RasF!E21","v":0},0,0,0,0]
[154,{"$f":"RasF!C22","v":11},{"$f":"RasF!D22","v":0},{"$f":"RasF!E22","v":0},0,0,{"$f":"B1297/1000*C1297+B1297/500*D1297","v":0},0]
[154,{"$f":"RasF!C23","v":12},{"$f":"RasF!D23","v":0},{"$f":"RasF!E23","v":0},0,0,0,0]
[154,{"$f":"RasF!C24","v":13},{"$f":"RasF!D24","v":0},{"$f":"RasF!E24","v":0},0,0,0,0]
[154,{"$f":"RasF!C25","v":14},{"$f":"RasF!D25","v":0},{"$f":"RasF!E25","v":0},0,0,0,0]
[154,{"$f":"RasF!C26","v":15},{"$f":"RasF!D26","v":0},{"$f":"RasF!E26","v":0},0,0,0,0]
[154,{"$f":"RasF!C27","v":16},{"$f":"RasF!D27","v":0},{"$f":"RasF!E27","v":0},0,0,0,0]
[154,{"$f":"RasF!C28","v":17},{"$f":"RasF!D28","v":0},{"$f":"RasF!E28","v":0},0,0,0,0]
[154,{"$f":"RasF!C29","v":18},{"$f":"RasF!D29","v":0},{"$f":"RasF!E29","v":0},0,0,0,0]
[154,{"$f":"RasF!C30","v":19},{"$f":"RasF!D30","v":0},{"$f":"RasF!E30","v":0},0,0,0,0]
[154,{"$f":"RasF!C31","v":20},{"$f":"RasF!D31","v":0},{"$f":"RasF!E31","v":0},0,0,0,0]
[154,{"$f":"RasF!C32","v":21},{"$f":"RasF!D32","v":0},{"$f":"RasF!E32","v":0},0,0,0,0]
[154,{"$f":"RasF!C33","v":22},{"$f":"RasF!D33","v":0},{"$f":"RasF!E33","v":0},0,0,0,0]
[154,{"$f":"RasF!C34","v":23},{"$f":"RasF!D34","v":0},{"$f":"RasF!E34","v":0},0,0,0,0]
[154,{"$f":"RasF!C35","v":24},{"$f":"RasF!D35","v":0},{"$f":"RasF!E35","v":0},0,0,0,0]
[154,{"$f":"RasF!C36","v":25},{"$f":"RasF!D36","v":0},{"$f":"RasF!E36","v":0},0,0,0,0]
[154,{"$f":"RasF!C37","v":26},{"$f":"RasF!D37","v":0},{"$f":"RasF!E37","v":0},0,0,0,0]
[154,{"$f":"RasF!C38","v":27},{"$f":"RasF!D38","v":0},{"$f":"RasF!E38","v":0},0,0,0,0]
[154,{"$f":"RasF!C39","v":28},{"$f":"RasF!D39","v":0},{"$f":"RasF!E39","v":0},0,0,0,0]
[154,{"$f":"RasF!C40","v":29},{"$f":"RasF!D40","v":0},{"$f":"RasF!E40","v":0},0,0,0,0]
[154,{"$f":"RasF!C41","v":30},{"$f":"RasF!D41","v":0},{"$f":"RasF!E41","v":0},0,0,0,0]
[154,{"$f":"RasF!C42","v":31},{"$f":"RasF!D42","v":0},{"$f":"RasF!E42","v":0},0,0,0,0]
[154,{"$f":"RasF!C43","v":32},{"$f":"RasF!D43","v":0},{"$f":"RasF!E43","v":0},0,0,0,0]
[154,{"$f":"RasF!C44","v":33},{"$f":"RasF!D44","v":0},{"$f":"RasF!E44","v":0},0,0,0,0]
[154,{"$f":"RasF!C45","v":34},{"$f":"RasF!D45","v":0},{"$f":"RasF!E45","v":0},0,0,0,0]
[154,{"$f":"RasF!C46","v":35},{"$f":"RasF!D46","v":0},{"$f":"RasF!E46","v":0},0,0,0,0]
[154,{"$f":"RasF!C47","v":36},{"$f":"RasF!D47","v":0},{"$f":"RasF!E47","v":0},0,0,0,0]
[154,{"$f":"RasF!C48","v":37},{"$f":"RasF!D48","v":0},{"$f":"RasF!E48","v":0},0,0,0,0]
[154,{"$f":"RasF!C49","v":38},{"$f":"RasF!D49","v":0},{"$f":"RasF!E49","v":0},0,0,0,0]
[154,{"$f":"RasF!C50","v":39},{"$f":"RasF!D50","v":0},{"$f":"RasF!E50","v":0},0,0,0,0]
[154,{"$f":"RasF!C51","v":40},{"$f":"RasF!D51","v":0},{"$f":"RasF!E51","v":0},0,0,0,0]
[154,{"$f":"RasF!C52","v":41},{"$f":"RasF!D52","v":0},{"$f":"RasF!E52","v":0},0,0,0,0]
[154,{"$f":"RasF!C53","v":42},{"$f":"RasF!D53","v":0},{"$f":"RasF!E53","v":0},0,0,0,0]
[154,{"$f":"RasF!C54","v":43},{"$f":"RasF!D54","v":0},{"$f":"RasF!E54","v":0},0,0,0,0]
[154,{"$f":"RasF!C55","v":44},{"$f":"RasF!D55","v":0},{"$f":"RasF!E55","v":0},0,0,0,0]
[154,{"$f":"RasF!C56","v":45},{"$f":"RasF!D56","v":0},{"$f":"RasF!E56","v":0},0,0,0,0]
[154,{"$f":"RasF!C57","v":46},{"$f":"RasF!D57","v":0},{"$f":"RasF!E57","v":0},0,0,0,0]
[154,{"$f":"RasF!C58","v":47},{"$f":"RasF!D58","v":0},{"$f":"RasF!E58","v":0},0,0,0,0]
[154,{"$f":"RasF!C59","v":48},{"$f":"RasF!D59","v":0},{"$f":"RasF!E59","v":0},0,0,0,0]
[154,{"$f":"RasF!C60","v":49},{"$f":"RasF!D60","v":0},{"$f":"RasF!E60","v":0},0,0,0,0]
[154,{"$f":"RasF!C61","v":50},{"$f":"RasF!D61","v":0},{"$f":"RasF!E61","v":0},0,0,0,0]
[154,{"$f":"RasF!C62","v":51},{"$f":"RasF!D62","v":0},{"$f":"RasF!E62","v":0},0,0,0,0]
[154,{"$f":"RasF!C63","v":52},{"$f":"RasF!D63","v":0},{"$f":"RasF!E63","v":0},0,0,0,0]
[154,{"$f":"RasF!C64","v":53},{"$f":"RasF!D64","v":0},{"$f":"RasF!E64","v":0},0,0,0,0]
[154,{"$f":"RasF!C65","v":54},{"$f":"RasF!D65","v":0},{"$f":"RasF!E65","v":0},0,0,0,0]
[154,{"$f":"RasF!C66","v":55},{"$f":"RasF!D66","v":0},{"$f":"RasF!E66","v":0},0,0,0,0]
[154,{"$f":"RasF!C67","v":56},{"$f":"RasF!D67","v":0},{"$f":"RasF!E67","v":0},0,0,0,0]
[154,{"$f":"RasF!C68","v":57},{"$f":"RasF!D68","v":0},{"$f":"RasF!E68","v":0},0,0,0,0]
[154,{"$f":"RasF!C69","v":58},{"$f":"RasF!D69","v":0},{"$f":"RasF!E69","v":0},0,0,0,0]
[154,{"$f":"RasF!C70","v":59},{"$f":"RasF!D70","v":0},{"$f":"RasF!E70","v":0},0,0,0,0]
[154,{"$f":"RasF!C71","v":60},{"$f":"RasF!D71","v":0},{"$f":"RasF!E71","v":0},0,0,0,{"$f":"ABS(C1346-ROUND(C1346,0))+ABS(D1346-ROUND(D1346,0))","v":0}]
[154,{"$f":"RasF!C72","v":61},{"$f":"RasF!D72","v":0},{"$f":"RasF!E72","v":0},0,0,0,0]
[154,{"$f":"RasF!C73","v":62},{"$f":"RasF!D73","v":0},{"$f":"RasF!E73","v":0},0,0,0,0]
[154,{"$f":"RasF!C74","v":63},{"$f":"RasF!D74","v":0},{"$f":"RasF!E74","v":0},0,0,0,0]
[154,{"$f":"RasF!C75","v":64},{"$f":"RasF!D75","v":0},{"$f":"RasF!E75","v":0},0,0,0,0]
[154,{"$f":"RasF!C76","v":65},{"$f":"RasF!D76","v":0},{"$f":"RasF!E76","v":0},0,0,0,0]
[154,{"$f":"RasF!C77","v":66},{"$f":"RasF!D77","v":0},{"$f":"RasF!E77","v":0},0,0,0,0]
[154,{"$f":"RasF!C78","v":67},{"$f":"RasF!D78","v":0},{"$f":"RasF!E78","v":0},0,0,0,0]
[154,{"$f":"RasF!C79","v":68},{"$f":"RasF!D79","v":0},{"$f":"RasF!E79","v":0},0,0,0,0]
[154,{"$f":"RasF!C80","v":69},{"$f":"RasF!D80","v":0},{"$f":"RasF!E80","v":0},0,0,0,0]
[154,{"$f":"RasF!C81","v":70},{"$f":"RasF!D81","v":0},{"$f":"RasF!E81","v":0},0,0,0,0]
[154,{"$f":"RasF!C82","v":71},{"$f":"RasF!D82","v":0},{"$f":"RasF!E82","v":0},0,0,0,0]
[154,{"$f":"RasF!C83","v":72},{"$f":"RasF!D83","v":0},{"$f":"RasF!E83","v":0},0,0,0,0]
[154,{"$f":"RasF!C84","v":73},{"$f":"RasF!D84","v":0},{"$f":"RasF!E84","v":0},0,0,0,0]
[154,{"$f":"RasF!C85","v":74},{"$f":"RasF!D85","v":0},{"$f":"RasF!E85","v":0},0,0,0,0]
[154,{"$f":"RasF!C86","v":75},{"$f":"RasF!D86","v":0},{"$f":"RasF!E86","v":0},0,0,{"$f":"B1361/1000*C1361+B1361/500*D1361","v":0},0]
[154,{"$f":"RasF!C87","v":76},{"$f":"RasF!D87","v":0},{"$f":"RasF!E87","v":0},0,0,0,0]
[154,{"$f":"RasF!C88","v":77},{"$f":"RasF!D88","v":0},{"$f":"RasF!E88","v":0},0,0,0,0]
[154,{"$f":"RasF!C89","v":78},{"$f":"RasF!D89","v":0},{"$f":"RasF!E89","v":0},0,0,0,0]
[154,{"$f":"RasF!C90","v":79},{"$f":"RasF!D90","v":0},{"$f":"RasF!E90","v":0},0,0,0,0]
[154,{"$f":"RasF!C91","v":80},{"$f":"RasF!D91","v":0},{"$f":"RasF!E91","v":0},0,0,0,0]
[154,{"$f":"RasF!C92","v":81},{"$f":"RasF!D92","v":0},{"$f":"RasF!E92","v":0},0,0,0,0]
[154,{"$f":"RasF!C93","v":82},{"$f":"RasF!D93","v":0},{"$f":"RasF!E93","v":0},0,0,0,0]
[154,{"$f":"RasF!C94","v":83},{"$f":"RasF!D94","v":0},{"$f":"RasF!E94","v":0},0,0,0,0]
[154,{"$f":"RasF!C95","v":84},{"$f":"RasF!D95","v":0},{"$f":"RasF!E95","v":0},0,0,0,0]
[154,{"$f":"RasF!C96","v":85},{"$f":"RasF!D96","v":0},{"$f":"RasF!E96","v":0},0,0,0,0]
[154,{"$f":"RasF!C97","v":86},{"$f":"RasF!D97","v":0},{"$f":"RasF!E97","v":0},0,0,0,0]
[154,{"$f":"RasF!C98","v":87},{"$f":"RasF!D98","v":0},{"$f":"RasF!E98","v":0},0,0,0,0]
[154,{"$f":"RasF!C99","v":88},{"$f":"RasF!D99","v":0},{"$f":"RasF!E99","v":0},0,0,0,0]
[154,{"$f":"RasF!C100","v":89},{"$f":"RasF!D100","v":0},{"$f":"RasF!E100","v":0},0,0,0,0]
[154,{"$f":"RasF!C101","v":90},{"$f":"RasF!D101","v":0},{"$f":"RasF!E101","v":0},0,0,0,0]
[154,{"$f":"RasF!C102","v":91},{"$f":"RasF!D102","v":0},{"$f":"RasF!E102","v":0},0,0,0,0]
[154,{"$f":"RasF!C103","v":92},{"$f":"RasF!D103","v":0},{"$f":"RasF!E103","v":0},0,0,0,0]
[154,{"$f":"RasF!C104","v":93},{"$f":"RasF!D104","v":0},{"$f":"RasF!E104","v":0},0,0,0,0]
[154,{"$f":"RasF!C105","v":94},{"$f":"RasF!D105","v":0},{"$f":"RasF!E105","v":0},0,0,0,0]
[154,{"$f":"RasF!C106","v":95},{"$f":"RasF!D106","v":0},{"$f":"RasF!E106","v":0},0,0,0,0]
[154,{"$f":"RasF!C107","v":96},{"$f":"RasF!D107","v":0},{"$f":"RasF!E107","v":0},0,0,0,0]
[154,{"$f":"RasF!C108","v":97},{"$f":"RasF!D108","v":0},{"$f":"RasF!E108","v":0},0,0,0,0]
[154,{"$f":"RasF!C109","v":98},{"$f":"RasF!D109","v":0},{"$f":"RasF!E109","v":0},0,0,0,0]
[154,{"$f":"RasF!C110","v":99},{"$f":"RasF!D110","v":0},{"$f":"RasF!E110","v":0},0,0,0,0]
[154,{"$f":"RasF!C111","v":100},{"$f":"RasF!D111","v":0},{"$f":"RasF!E111","v":0},0,0,0,0]
[154,{"$f":"RasF!C112","v":101},{"$f":"RasF!D112","v":0},{"$f":"RasF!E112","v":0},0,0,0,0]
[154,{"$f":"RasF!C113","v":102},{"$f":"RasF!D113","v":0},{"$f":"RasF!E113","v":0},0,0,0,0]
[154,{"$f":"RasF!C114","v":103},{"$f":"RasF!D114","v":0},{"$f":"RasF!E114","v":0},0,0,0,0]
[154,{"$f":"RasF!C115","v":104},{"$f":"RasF!D115","v":0},{"$f":"RasF!E115","v":0},0,0,0,0]
[154,{"$f":"RasF!C116","v":105},{"$f":"RasF!D116","v":0},{"$f":"RasF!E116","v":0},0,0,0,0]
[154,{"$f":"RasF!C117","v":106},{"$f":"RasF!D117","v":0},{"$f":"RasF!E117","v":0},0,0,0,0]
[154,{"$f":"RasF!C118","v":107},{"$f":"RasF!D118","v":0},{"$f":"RasF!E118","v":0},0,0,0,0]
[154,{"$f":"RasF!C119","v":108},{"$f":"RasF!D119","v":0},{"$f":"RasF!E119","v":0},0,0,0,0]
[154,{"$f":"RasF!C120","v":109},{"$f":"RasF!D120","v":0},{"$f":"RasF!E120","v":0},0,0,0,0]
[154,{"$f":"RasF!C121","v":110},{"$f":"RasF!D121","v":7358507},{"$f":"RasF!E121","v":7894608},0,0,2546249.5300000003,0]
[154,{"$f":"RasF!C122","v":111},{"$f":"RasF!D122","v":6940557},{"$f":"RasF!E122","v":7433792},0,0,2420703.6510000001,0]
[154,{"$f":"RasF!C123","v":112},{"$f":"RasF!D123","v":0},{"$f":"RasF!E123","v":0},0,0,0,0]
[154,{"$f":"RasF!C124","v":113},{"$f":"RasF!D124","v":6940557},{"$f":"RasF!E124","v":7433792},0,0,2464319.9330000002,0]
[154,{"$f":"RasF!C125","v":114},{"$f":"RasF!D125","v":0},{"$f":"RasF!E125","v":0},0,0,0,0]
[154,{"$f":"RasF!C126","v":115},{"$f":"RasF!D126","v":0},{"$f":"RasF!E126","v":0},0,0,0,0]
[154,{"$f":"RasF!C127","v":116},{"$f":"RasF!D127","v":0},{"$f":"RasF!E127","v":0},0,0,0,0]
[154,{"$f":"RasF!C128","v":117},{"$f":"RasF!D128","v":0},{"$f":"RasF!E128","v":0},0,0,0,0]
[154,{"$f":"RasF!C129","v":118},{"$f":"RasF!D129","v":0},{"$f":"RasF!E129","v":0},0,0,0,0]
[154,{"$f":"RasF!C130","v":119},{"$f":"RasF!D130","v":0},{"$f":"RasF!E130","v":0},0,0,0,0]
[154,{"$f":"RasF!C131","v":120},{"$f":"RasF!D131","v":0},{"$f":"RasF!E131","v":0},0,0,0,0]
[154,{"$f":"RasF!C132","v":121},{"$f":"RasF!D132","v":417950},{"$f":"RasF!E132","v":460816},0,0,162089.42199999999,0]
[154,{"$f":"RasF!C133","v":122},{"$f":"RasF!D133","v":0},{"$f":"RasF!E133","v":0},0,0,0,0]
[154,{"$f":"RasF!C134","v":123},{"$f":"RasF!D134","v":0},{"$f":"RasF!E134","v":0},0,0,0,0]
[154,{"$f":"RasF!C135","v":124},{"$f":"RasF!D135","v":0},{"$f":"RasF!E135","v":0},0,0,0,{"$f":"ABS(C1410-ROUND(C1410,0))+ABS(D1410-ROUND(D1410,0))","v":0}]
[154,{"$f":"RasF!C136","v":125},{"$f":"RasF!D136","v":0},{"$f":"RasF!E136","v":0},0,0,0,0]
[154,{"$f":"RasF!C137","v":126},{"$f":"RasF!D137","v":0},{"$f":"RasF!E137","v":0},0,0,0,0]
[154,{"$f":"RasF!C138","v":127},{"$f":"RasF!D138","v":0},{"$f":"RasF!E138","v":0},0,0,0,0]
[154,{"$f":"RasF!C139","v":128},{"$f":"RasF!D139","v":0},{"$f":"RasF!E139","v":0},0,0,0,0]
[154,{"$f":"RasF!C140","v":129},{"$f":"RasF!D140","v":0},{"$f":"RasF!E140","v":0},0,0,0,0]
[154,{"$f":"RasF!C141","v":130},{"$f":"RasF!D141","v":0},{"$f":"RasF!E141","v":0},0,0,0,0]
[154,{"$f":"RasF!C142","v":131},{"$f":"RasF!D142","v":0},{"$f":"RasF!E142","v":0},0,0,0,0]
[154,{"$f":"RasF!C143","v":132},{"$f":"RasF!D143","v":0},{"$f":"RasF!E143","v":0},0,0,0,0]
[154,{"$f":"RasF!C144","v":133},{"$f":"RasF!D144","v":0},{"$f":"RasF!E144","v":0},0,0,0,0]
[154,{"$f":"RasF!C145","v":134},{"$f":"RasF!D145","v":0},{"$f":"RasF!E145","v":0},0,0,0,0]
[154,{"$f":"RasF!C146","v":135},{"$f":"RasF!D146","v":0},{"$f":"RasF!E146","v":0},0,0,0,0]
[154,{"$f":"RasF!C147","v":136},{"$f":"RasF!D147","v":0},{"$f":"RasF!E147","v":0},0,0,0,0]
[154,{"$f":"RasF!C148","v":137},{"$f":"RasF!D148","v":7358507},{"$f":"RasF!E148","v":7894608},0,0,3171238.051,0]
[156,{"$f":"PVRIO!C12","v":1},{"$f":"PVRIO!D12","v":0},{"$f":"PVRIO!E12","v":35027},0,0,70.054000000000002,0,0]
[156,{"$f":"PVRIO!C13","v":2},{"$f":"PVRIO!D13","v":0},{"$f":"PVRIO!E13","v":0},0,0,{"$f":"B1425/1000*C1425+B1425/500*D1425","v":0},0,0]
[156,{"$f":"PVRIO!C14","v":3},{"$f":"PVRIO!D14","v":0},{"$f":"PVRIO!E14","v":0},0,0,0,0,0]
[156,{"$f":"PVRIO!C15","v":4},{"$f":"PVRIO!D15","v":0},{"$f":"PVRIO!E15","v":0},0,0,0,0,{"$f":"G1427*H1427","v":0}]
[156,{"$f":"PVRIO!C16","v":5},{"$f":"PVRIO!D16","v":0},{"$f":"PVRIO!E16","v":0},0,0,0,0,0]
[156,{"$f":"PVRIO!C17","v":6},{"$f":"PVRIO!D17","v":0},{"$f":"PVRIO!E17","v":0},0,0,0,0,0]
[156,{"$f":"PVRIO!C18","v":7},{"$f":"PVRIO!D18","v":0},{"$f":"PVRIO!E18","v":0},0,0,0,0,0]
[156,{"$f":"PVRIO!C19","v":8},{"$f":"PVRIO!D19","v":0},{"$f":"PVRIO!E19","v":0},0,0,0,0,0]
[156,{"$f":"PVRIO!C20","v":9},{"$f":"PVRIO!D20","v":0},{"$f":"PVRIO!E20","v":0},0,0,0,0,0]
[156,{"$f":"PVRIO!C21","v":10},{"$f":"PVRIO!D21","v":0},{"$f":"PVRIO!E21","v":0},0,0,0,0,0]
[156,{"$f":"PVRIO!C22","v":11},{"$f":"PVRIO!D22","v":0},{"$f":"PVRIO!E22","v":0},0,0,0,0,{"$f":"G1434*H1434","v":0}]
[156,{"$f":"PVRIO!C23","v":12},{"$f":"PVRIO!D23","v":0},{"$f":"PVRIO!E23","v":0},0,0,0,0,0]
[156,{"$f":"PVRIO!C24","v":13},{"$f":"PVRIO!D24","v":0},{"$f":"PVRIO!E24","v":0},0,0,0,0,0]
[156,{"$f":"PVRIO!C25","v":14},{"$f":"PVRIO!D25","v":0},{"$f":"PVRIO!E25","v":0},0,0,0,0,0]
[156,{"$f":"PVRIO!C26","v":15},{"$f":"PVRIO!D26","v":0},{"$f":"PVRIO!E26","v":0},0,0,0,0,0]
[156,{"$f":"PVRIO!C27","v":16},{"$f":"PVRIO!D27","v":0},{"$f":"PVRIO!E27","v":0},0,0,0,0,0]
[156,{"$f":"PVRIO!C28","v":17},{"$f":"PVRIO!D28","v":0},{"$f":"PVRIO!E28","v":0},0,0,0,0,0]
[156,{"$f":"PVRIO!C29","v":18},{"$f":"PVRIO!D29","v":0},{"$f":"PVRIO!E29","v":35027},0,0,1260.972,0,0]
[156,{"$f":"PVRIO!C30","v":19},{"$f":"PVRIO!D30","v":0},{"$f":"PVRIO!E30","v":35027},0,0,1331.0260000000001,0,0]
[156,{"$f":"PVRIO!C31","v":20},{"$f":"PVRIO!D31","v":0},{"$f":"PVRIO!E31","v":0},0,0,0,0,{"$f":"G1443*H1443","v":0}]
[156,{"$f":"PVRIO!C32","v":21},{"$f":"PVRIO!D32","v":0},{"$f":"PVRIO!E32","v":26549},0,0,1115.058,0,0]
[156,{"$f":"PVRIO!C33","v":22},{"$f":"PVRIO!D33","v":0},{"$f":"PVRIO!E33","v":0},0,0,0,0,0]
[156,{"$f":"PVRIO!C34","v":23},{"$f":"PVRIO!D34","v":0},{"$f":"PVRIO!E34","v":8478},0,0,389.988,0,0]
[156,{"$f":"PVRIO!C35","v":24},{"$f":"PVRIO!D35","v":0},{"$f":"PVRIO!E35","v":0},0,0,0,0,0]
[156,{"$f":"PVRIO!C36","v":25},{"$f":"PVRIO!D36","v":0},{"$f":"PVRIO!E36","v":0},0,0,0,0,0]
[156,{"$f":"PVRIO!C37","v":26},{"$f":"PVRIO!D37","v":0},{"$f":"PVRIO!E37","v":0},0,0,0,0,0]
[156,{"$f":"PVRIO!C38","v":27},{"$f":"PVRIO!D38","v":0},{"$f":"PVRIO!E38","v":0},0,0,0,0,{"$f":"G1450*H1450","v":0}]
[156,{"$f":"PVRIO!C39","v":28},{"$f":"PVRIO!D39","v":0},{"$f":"PVRIO!E39","v":0},0,0,0,0,0]
[156,{"$f":"PVRIO!C40","v":29},{"$f":"PVRIO!D40","v":0},{"$f":"PVRIO!E40","v":0},0,0,0,0,0]
[156,{"$f":"PVRIO!C41","v":30},{"$f":"PVRIO!D41","v":0},{"$f":"PVRIO!E41","v":0},0,0,0,0,0]
[156,{"$f":"PVRIO!C42","v":31},{"$f":"PVRIO!D42","v":0},{"$f":"PVRIO!E42","v":0},0,0,0,0,0]
[156,{"$f":"PVRIO!C43","v":32},{"$f":"PVRIO!D43","v":0},{"$f":"PVRIO!E43","v":0},0,0,0,0,0]
[156,{"$f":"PVRIO!C44","v":33},{"$f":"PVRIO!D44","v":0},{"$f":"PVRIO!E44","v":0},0,0,0,0,0]
[156,{"$f":"PVRIO!C45","v":34},{"$f":"PVRIO!D45","v":0},{"$f":"PVRIO!E45","v":0},0,0,0,0,0]
[156,{"$f":"PVRIO!C46","v":35},{"$f":"PVRIO!D46","v":0},{"$f":"PVRIO!E46","v":0},0,0,0,0,0]
[156,{"$f":"PVRIO!C47","v":36},{"$f":"PVRIO!D47","v":0},{"$f":"PVRIO!E47","v":0},0,0,0,0,{"$f":"G1459*H1459","v":0}]
[156,{"$f":"PVRIO!C48","v":37},{"$f":"PVRIO!D48","v":0},{"$f":"PVRIO!E48","v":0},0,0,0,0,{"$f":"G1460*H1460","v":0}]
[156,{"$f":"PVRIO!C49","v":38},{"$f":"PVRIO!D49","v":0},{"$f":"PVRIO!E49","v":0},0,0,0,0,{"$f":"G1461*H1461","v":0}]
[156,{"$f":"PVRIO!C50","v":39},{"$f":"PVRIO!D50","v":0},{"$f":"PVRIO!E50","v":0},0,0,0,0,{"$f":"G1462*H1462","v":0}]
[156,{"$f":"PVRIO!C51","v":40},{"$f":"PVRIO!D51","v":0},{"$f":"PVRIO!E51","v":0},0,0,0,0,0]
[156,{"$f":"PVRIO!C52","v":41},{"$f":"PVRIO!D52","v":0},{"$f":"PVRIO!E52","v":0},0,0,0,0,{"$f":"G1464*H1464","v":0}]
[156,{"$f":"PVRIO!C53","v":42},{"$f":"PVRIO!D53","v":0},{"$f":"PVRIO!E53","v":0},0,0,0,0,{"$f":"G1465*H1465","v":0}]
[156,{"$f":"PVRIO!C54","v":43},{"$f":"PVRIO!D54","v":0},{"$f":"PVRIO!E54","v":0},0,0,0,0,{"$f":"G1466*H1466","v":0}]
[156,{"$f":"PVRIO!C55","v":44},{"$f":"PVRIO!D55","v":0},{"$f":"PVRIO!E55","v":0},0,0,0,0,{"$f":"G1467*H1467","v":0}]
[159,{"$f":"Obv!C12","v":1},{"$f":"Obv!D12","v":597788},null,0,0,{"$f":"B1468/1000*C1468","v":597.78800000000001},{"$f":"ABS(C1468-ROUND(C1468,0))","v":0}]
[159,{"$f":"Obv!C13","v":2},{"$f":"Obv!D13","v":7940231},0,0,0,15880.462,0]
[159,{"$f":"Obv!C14","v":3},{"$f":"Obv!D14","v":43354},0,0,0,130.06200000000001,0]
[159,{"$f":"Obv!C15","v":4},{"$f":"Obv!D15","v":7842913},0,0,0,31371.652000000002,0]
[159,{"$f":"Obv!C16","v":5},{"$f":"Obv!D16","v":6380729},0,0,0,31903.645,0]
[159,{"$f":"Obv!C17","v":6},{"$f":"Obv!D17","v":1425026},0,0,0,8550.1560000000009,0]
[159,{"$f":"Obv!C18","v":7},{"$f":"Obv!D18","v":37158},0,0,0,260.10599999999999,0]
[159,{"$f":"Obv!C19","v":8},{"$f":"Obv!D19","v":0},0,0,0,0,0]
[159,{"$f":"Obv!C20","v":9},{"$f":"Obv!D20","v":0},0,0,0,0,0]
[159,{"$f":"Obv!C21","v":10},{"$f":"Obv!D21","v":0},0,0,0,0,0]
[159,{"$f":"Obv!C22","v":11},{"$f":"Obv!D22","v":0},0,0,0,0,0]
[159,{"$f":"Obv!C23","v":12},{"$f":"Obv!D23","v":53964},0,0,0,647.56799999999998,0]
[159,{"$f":"Obv!C24","v":13},{"$f":"Obv!D24","v":0},0,0,0,0,0]
[159,{"$f":"Obv!C25","v":14},{"$f":"Obv!D25","v":0},0,0,0,0,0]
[159,{"$f":"Obv!C26","v":15},{"$f":"Obv!D26","v":0},0,0,0,0,0]
[159,{"$f":"Obv!C27","v":16},{"$f":"Obv!D27","v":0},0,0,0,0,0]
[159,{"$f":"Obv!C28","v":17},{"$f":"Obv!D28","v":0},0,0,0,0,0]
[159,{"$f":"Obv!C29","v":18},{"$f":"Obv!D29","v":0},0,0,0,0,0]
[159,{"$f":"Obv!C30","v":19},{"$f":"Obv!D30","v":7846498},0,0,0,149083.462,0]
[159,{"$f":"Obv!C31","v":20},{"$f":"Obv!D31","v":29994},0,0,0,599.88,0]
[159,{"$f":"Obv!C32","v":21},{"$f":"Obv!D32","v":7762540},0,0,0,163013.34,0]
[159,{"$f":"Obv!C33","v":22},{"$f":"Obv!D33","v":6306750},0,0,0,138748.5,0]
[159,{"$f":"Obv!C34","v":23},{"$f":"Obv!D34","v":1417962},0,0,0,32613.126,0]
[159,{"$f":"Obv!C35","v":24},{"$f":"Obv!D35","v":37828},0,0,0,907.87200000000007,0]
[159,{"$f":"Obv!C36","v":25},{"$f":"Obv!D36","v":0},0,0,0,0,0]
[159,{"$f":"Obv!C37","v":26},{"$f":"Obv!D37","v":0},0,0,0,0,0]
[159,{"$f":"Obv!C38","v":27},{"$f":"Obv!D38","v":0},0,0,0,0,0]
[159,{"$f":"Obv!C39","v":28},{"$f":"Obv!D39","v":0},0,0,0,0,0]
[159,{"$f":"Obv!C40","v":29},{"$f":"Obv!D40","v":53964},0,0,0,1564.9560000000001,0]
[159,{"$f":"Obv!C41","v":30},{"$f":"Obv!D41","v":0},0,0,0,0,0]
[159,{"$f":"Obv!C42","v":31},{"$f":"Obv!D42","v":0},0,0,0,0,0]
[159,{"$f":"Obv!C43","v":32},{"$f":"Obv!D43","v":0},0,0,0,0,0]
[159,{"$f":"Obv!C44","v":33},{"$f":"Obv!D44","v":0},0,0,0,{"$f":"B1500/1000*C1500","v":0},{"$f":"ABS(C1500-ROUND(C1500,0))","v":0}]
[159,{"$f":"Obv!C45","v":34},{"$f":"Obv!D45","v":0},0,0,0,0,0]
[159,{"$f":"Obv!C46","v":35},{"$f":"Obv!D46","v":0},0,0,0,0,0]
[159,{"$f":"Obv!C47","v":36},{"$f":"Obv!D47","v":691521},0,0,0,24894.755999999998,0]
[159,{"$f":"Obv!C48","v":37},{"$f":"Obv!D48","v":14900},0,0,0,551.29999999999995,0]
[159,{"$f":"Obv!C49","v":38},{"$f":"Obv!D49","v":14900},0,0,0,566.19999999999993,0]
[159,{"$f":"Obv!C50","v":39},{"$f":"Obv!D50","v":14900},0,0,0,581.1,0]
[159,{"$f":"Obv!C51","v":40},{"$f":"Obv!D51","v":0},0,0,0,0,0]
[159,{"$f":"Obv!C52","v":41},{"$f":"Obv!D52","v":0},0,0,0,0,0]
[159,{"$f":"Obv!C53","v":42},{"$f":"Obv!D53","v":0},0,0,0,0,0]
[159,{"$f":"Obv!C54","v":43},{"$f":"Obv!D54","v":0},0,0,0,0,0]
[159,{"$f":"Obv!C55","v":44},{"$f":"Obv!D55","v":0},0,0,0,0,0]
[159,{"$f":"Obv!C56","v":45},{"$f":"Obv!D56","v":0},0,0,0,0,0]
[159,{"$f":"Obv!C57","v":46},{"$f":"Obv!D57","v":0},0,0,0,0,0]
[159,{"$f":"Obv!C58","v":47},{"$f":"Obv!D58","v":0},0,0,0,0,0]
[159,{"$f":"Obv!C59","v":48},{"$f":"Obv!D59","v":0},0,0,0,0,0]
[159,{"$f":"Obv!C60","v":49},{"$f":"Obv!D60","v":0},0,0,0,0,0]
[159,{"$f":"Obv!C61","v":50},{"$f":"Obv!D61","v":0},0,0,0,0,0]
[159,{"$f":"Obv!C62","v":51},{"$f":"Obv!D62","v":0},0,0,0,0,0]
[159,{"$f":"Obv!C63","v":52},{"$f":"Obv!D63","v":0},0,0,0,0,0]
[159,{"$f":"Obv!C64","v":53},{"$f":"Obv!D64","v":0},0,0,0,0,0]
[159,{"$f":"Obv!C65","v":54},{"$f":"Obv!D65","v":0},0,0,0,0,0]
[159,{"$f":"Obv!C66","v":55},{"$f":"Obv!D66","v":0},0,0,0,0,0]
[159,{"$f":"Obv!C67","v":56},{"$f":"Obv!D67","v":0},0,0,0,0,0]
[159,{"$f":"Obv!C68","v":57},{"$f":"Obv!D68","v":0},0,0,0,0,0]
[159,{"$f":"Obv!C69","v":58},{"$f":"Obv!D69","v":0},0,0,0,0,0]
[159,{"$f":"Obv!C70","v":59},{"$f":"Obv!D70","v":0},0,0,0,0,0]
[159,{"$f":"Obv!C71","v":60},{"$f":"Obv!D71","v":0},0,0,0,0,0]
[159,{"$f":"Obv!C72","v":61},{"$f":"Obv!D72","v":0},0,0,0,0,0]
[159,{"$f":"Obv!C73","v":62},{"$f":"Obv!D73","v":0},0,0,0,0,0]
[159,{"$f":"Obv!C74","v":63},{"$f":"Obv!D74","v":0},0,0,0,0,0]
[159,{"$f":"Obv!C75","v":64},{"$f":"Obv!D75","v":0},0,0,0,0,0]
[159,{"$f":"Obv!C76","v":65},{"$f":"Obv!D76","v":0},0,0,0,{"$f":"B1532/1000*C1532","v":0},{"$f":"ABS(C1532-ROUND(C1532,0))","v":0}]
[159,{"$f":"Obv!C77","v":66},{"$f":"Obv!D77","v":0},0,0,0,0,0]
[159,{"$f":"Obv!C78","v":67},{"$f":"Obv!D78","v":0},0,0,0,0,0]
[159,{"$f":"Obv!C79","v":68},{"$f":"Obv!D79","v":0},0,0,0,0,0]
[159,{"$f":"Obv!C80","v":69},{"$f":"Obv!D80","v":0},0,0,0,0,0]
[159,{"$f":"Obv!C81","v":70},{"$f":"Obv!D81","v":0},0,0,0,0,0]
[159,{"$f":"Obv!C82","v":71},{"$f":"Obv!D82","v":0},0,0,0,0,0]
[159,{"$f":"Obv!C83","v":72},{"$f":"Obv!D83","v":0},0,0,0,0,0]
[159,{"$f":"Obv!C84","v":73},{"$f":"Obv!D84","v":0},0,0,0,0,0]
[159,{"$f":"Obv!C85","v":74},{"$f":"Obv!D85","v":0},0,0,0,0,0]
[159,{"$f":"Obv!C86","v":75},{"$f":"Obv!D86","v":0},0,0,0,0,0]
[159,{"$f":"Obv!C87","v":76},{"$f":"Obv!D87","v":0},0,0,0,0,0]
[159,{"$f":"Obv!C88","v":77},{"$f":"Obv!D88","v":0},0,0,0,0,0]
[159,{"$f":"Obv!C89","v":78},{"$f":"Obv!D89","v":0},0,0,0,0,0]
[159,{"$f":"Obv!C90","v":79},{"$f":"Obv!D90","v":0},0,0,0,0,0]
[159,{"$f":"Obv!C91","v":80},{"$f":"Obv!D91","v":0},0,0,0,0,0]
[159,{"$f":"Obv!C92","v":81},{"$f":"Obv!D92","v":0},0,0,0,0,0]
[159,{"$f":"Obv!C93","v":82},{"$f":"Obv!D93","v":0},0,0,0,0,0]
[159,{"$f":"Obv!C94","v":83},{"$f":"Obv!D94","v":0},0,0,0,0,0]
[159,{"$f":"Obv!C95","v":84},{"$f":"Obv!D95","v":0},0,0,0,0,0]
[159,{"$f":"Obv!C96","v":85},{"$f":"Obv!D96","v":0},0,0,0,0,0]
[159,{"$f":"Obv!C97","v":86},{"$f":"Obv!D97","v":0},0,0,0,0,0]
[159,{"$f":"Obv!C98","v":87},{"$f":"Obv!D98","v":0},0,0,0,0,0]
[159,{"$f":"Obv!C99","v":88},{"$f":"Obv!D99","v":0},0,0,0,0,0]
[159,{"$f":"Obv!C100","v":89},{"$f":"Obv!D100","v":0},0,0,0,0,0]
[159,{"$f":"Obv!C101","v":90},{"$f":"Obv!D101","v":676621},0,0,0,60895.89,0]
[159,{"$f":"Obv!C102","v":91},{"$f":"Obv!D102","v":0},0,0,0,0,0]
[159,{"$f":"Obv!C103","v":92},{"$f":"Obv!D103","v":676621},0,0,0,62249.131999999998,0]
[159,{"$f":"Obv!C104","v":93},{"$f":"Obv!D104","v":0},0,0,0,0,0]
[159,{"$f":"Obv!C105","v":94},{"$f":"Obv!D105","v":0},0,0,0,0,0]

{"sheet":"Upute","index":1,"n_rows":24,"n_cols":2,"rows_kept":24,"cut":false,"hidden":false,"merged":[]}
[null,"Prelazak na Referentnu stranicu ––––>"]
[null,"OSNOVNE UPUTE ZA UNOS PODATAKA"]
[null,{"$f":" \"Ver. \" & MID(Skriveni!K31,1,1) & \".\" & MID(Skriveni!K31,2,1) & \".\" & MID(Skriveni!K31,3,1) & \".\"","v":"Ver. 5.0.4."}]
[null,"Od 2017. Potvrda o primitku se izdaje samo za potpun i ispravan izvještaj (svi potrebni obrasci popunjeni i sve kontrole točne). U slučaju nepotpunog ili neispravnog izvještaja, korisniku se izdaje samo lista pogrešaka. S obzirom da su od 2017. godine novi obrasci, još uvijek je moguće da neka od kontrola sadrži pogrešku. Utvrdite li takvu pogrešku, ili prilikom predaje u Finu dobijete ispis pogrešaka koje smatrate da ne stoje, dostavite popunjenu Excel datoteku ili izlist pogreški na adresu e-pošte: rgfi@fina.hr"]
[null,"Ovi izvještaji napravljeni su u Excel datoteci, format 97-2003. kako bi se omogućilo popunjavanje i korisnicima starijih verzija Excel-a. Moguće ju je popuniti u MS EXcel-u 97, XP, 2003, 2007, 2010, Office365, te novijim verzijama, a od besplatnih rješenja u OpenOffice-u 3.x i 4.x. Libre Office, Kingsoft Office te neki drugi alati koji imaju mogućnost rada s Excel datotekama nisu upotrebljivi za popunjavanje, kao ni neki drugi alati kojima je moguć rad s Excel datotekama jer ne sadrže bitne funkcionalnosti koje su potrebne da bi ugrađene formule i kontrole radile ispravno. Kod rada s novijim verzijama MS Excel-a važno je da datoteka ostane u ovom formatu, tj. da se ne pretvori u novi \".xlsx\" format. Ova verzija datoteke predviđena je za popunjavanje svih vrsta proračunskih obrazaca, za sve razine te za sva razdoblja od 2015. godini nadalje. Predaja ovih obrazaca za sada je moguća samo u poslovnicama Fine, a predaja putem web servisa je u planu. Od 2015. godine ukinuti su izvještaji NT i S-PR-RAS. Svi koji su za kvartale predavali obrazac S-PR-RAS, sad su dužni predati PR-RAS obrazac i za I. i III. kvartal. Isto tako, neki obveznici koji nisu bili obvezni predavati obrazac RAS-funkcijski za godinu sada su obvezni."]
[null,"Sva bitna pravila o popunjavanju obrazaca, poslovnim pravilima navedena su u nastavku uputa, ono što nije objašnjeno u uputama opisano je u kontrolama koje javljaju pogrešku. Prije nego rješenje problema potražite na broju telefona ili adresi e-pošte na dnu uputa, pokušajte ga pronaći u sklopu uputa. "]
[null,"Analizom najčešćih pogrešaka prilikom popunjavanja i predaje, nastojali smo na najmanju moguću mjeru smanjiti mogućnost pogreške pri popunjavanju te olakšati pronalaženje pogrešaki. Novost je da će se ćelija sa upisanim iznosom obojati žutom bojom ako iznos nije zaokružena vrijednost, a pozadina ćelije koja je upisana s predznakom minus tamo gdje to nije dopušteno obojat će se crvenom bojom. Iako je onemogućen ručni upis takvih podataka, programi koji pune Excel datoteku mogu u svaku ćeliju \"zgurati\" bilo kakvu vrijednost pa je kontrola ovog tipa potrebna. Na referentnoj stranici je pored svakog obrasca koji je popunjen upsan tekst \"NE\" ako obrazac nema matematičko logičkih pogrešaka, a u slučaju da ih ima, pisat će broj pogrešaka u crvenoj boji kako bi pogreške bile uočljivije. Na radnom listu Kont (kontrole), status ispravne kontrole \"Ispravna\" biti će zelene boje na bijeloj podlozi, a status kontrole u grešci biti će \"Pogreška\" bijelim slovima na crvenoj podlozi. Status kontrole upozorenja koje upozoravaju da provjerite neki iznos biti će \"Pozor!\" napisano žutim slovima na rozoj podlozi."]
[null,"Excel datoteka može javiti pogrešku iako je pored svih naziva obrazaca broj pogrešaka nula. To je moguće samo na godišnjoj razini kada postoje kontrole između obrazaca, tj. svaki obrazac sam za sebe može biti točan, ali kontrole između obrazaca uspoređuju istovjernte stavke u raznim obrascima, ako se one ne slažu (nisu iste), cijeli paket je u grešci, tj. neispravan."]
[null,"U nastavku su dane tehničke upute o popunajvanju obrazaca."]
[null,"U polja Datum od i Datum do upisuju se stvarni datumi unutar razdoblja izvještavanja u kojem je obveznik bio aktivan (tj. poslovao). Obveznik koji je počeo s radom tokom godine, upisuje datum stvarnog početka rada, a obveznik koji je prestaje s radom ili postaje druga vrsta obveznika upisuju stvarni datum prestanka rada, što znači da se u tim slučajevima ne upisuju 1.1. u Datum od, niti 31.12 u Datum do polje. Isti upisani datumi se prenose i na naslovnicu Referentne stranice. Za razliku od upisanih datuma, datumi na pojedinačnom obrascu se određuju prema odabranoj AOP oznaci razdoblja, tj. bez obzira koliko je obveznik stvarno poslovao unutar razdoblja obrade. Primjerice, za odabrano razdoblje 2015-12 na bilanci će se pojaviti datumi razdoblja za koje se izvještava (tj. 1.1. do 31. 12. 2015.), dok će se na obrascu obveze pojaviti datumi 1.10 do 31. 12. 2015.  jer je to stvarno razdoblje izvještavanja za taj obrazac. Prema kontrolama obveznosti, razini i odabranoj AOP oznaci razdoblja, u zaglavlju nekih obrasca će biti ispisan tekst - \"za odabrano razdoblje i razinu obrazac se ne popunjava\" (primjerice, Bil se popunjava samo kada je obrada za cijelu godinu (razdoblje 20XX-12) dok se PR-RAS popunjava samo za kvartale, a mjesečne obveze predaju se za sve mjesece."]
[null,"Navigacija kroz Excel datoteku riješena je na način da se sa svakog obrasca možete se vratiti na Referentnu stranicu, ili direktno na kontrole vezane za taj obrazac (klikom na žuti tekst na plavoj podlozi na vrhu ekrana), a sa referentne stranice možete se prebaciti na šifarnike, upute i kontrole. Sa referentne stranice na svaki od obrazaca prebacujete se klikom na ime obrasca na popisu obrazaca. Sa kontrola obrasca moguće je vratiti se na Referentnu stranicu (na vrhu ekrana) ili na svaki pojedini obrazac - klikom na ime obrasca u naslovima dijela kontrola koje se odnose na taj obrazac. Kako bi što bolje označili koja polja služe za navigaciju, ona su obojana tamnomodrozelenom bojom s žutim slovima. Mjesto za radni list Novosti je predviđeno, a ugradit ćemo ga neku novu verziju Excel datoteke kada to bude potrebno. Zbog toga je navigacija na List novosti bijela (Neaktivna)."]
[null,"Osnovni podaci o obvezniku unose se u radni list \"RefStr\" (Referentna stranica). Podaci u zaglavlju upisani u Referentnu stranicu prenose se automatizmom na sve ostale radne listove i obrasce. Time je osigurano da svi podaci iz zaglavlja, u svim obrascima budu identični. Svi podaci u zaglavlju čiji opis je označen tamnomodrom bojom obavezni su za unos. Preporuča se da popunite sva polja, jer nisu obavezni kontakt podaci o korisniku, a koji bi mogli zatrebati da Vas možemo obavijestiti o naknadno utvrđenim pogreškama ili novostima."]
[null,"Oznaka razdoblja, razine, šifre općine i djelatnosti možete upisati rukom ili izabrati s padajućeg izbornika na tom unosnom polju. Izbjegavajte unos ovih podataka metodama Copy/Paste iz nekih drugih Excel datoteka (Kopiraj/Zalijepi) kako ne biste prenijeli i neke formate iz te druge datoteke, a time spomenutu šifru učinili neprepoznatljivom za programsko učitavanje. Polja predviđena za unos u zaglavlju Referentne stranice označena su sivim rasterom. Razdoblje se unosi na način GGGG-MM gdje je GGGG godina, a MM mjesec u kojem završava razdoblje izvještavanja. Kako biste bili sigurni da nećete imati problema oko popunjavanja obrazaca, preporučeno je da regionalne postavke na računalu budu namještene za Hrvatsku, format datuma: DD.MM.GGGG (DD.MM.YYYY), a kod brojevnih vrijednosti točka za odvajanje tisućica, zarez kao decimalno mjesto. "]
[null,"Novost u odnosu na prijašnje obrasce je da se sve brojčane oznake (RKP, matični broj, broj pošte, razina, šifra djelatnosti, razdjel te šifra općine) unose kao brojevna vrijednost, bez vodećih nula, a nakon unosa, na Referentnoj stranici će se pokazati s vodećim nulama tamo gdje je to potrebno. Ovaj način uveden je kako bi istu Excel datoteku bilo moguće popunjavati i u Excel-u i u OpenOffice-u."]
[null,"U obrasce se unose iznosi samo pojedinačnih AOP oznaka. Sumarne AOP oznake se zaštićene su, u njih nije moguć unos, a izračunavaju se automatski na osnovu upisanih pojedinačnih iznosa. Upisuju se samo cjelobrojne vrijednosti. Iznosi s lipama nisu dopušteni. Sumarne AOP oznake u obrascu plave boje s podebljanim tipom slova (bold) da se bolje razlikuju. Vrijednosti tih pozicija izračunat će se automatski na osnovu upisanih pojedinačnih stavaka. Na obrascima koji imaju stupac indeks, taj podatak se ne upisuje već se izračunava automatski na osnovu upisanih vrijednosti. Tamo gdje indeks nije moguće izračunati pojavit će se crtica \"-\", a tamo gdje je indeks veći od 1000 pojavit će se tekst \">>100\"."]
[null,"Vrlo važno: Kod unosa vrijednosti naprednijim metodama Kopiraj/Zalijepi (Copy/Paste) iz nekih drugih dokumenata OBAVEZNO koristite metodu Copy (Kopiraj), a ne Cut (Izreži), jer se kod korištenja metode Cut/Paste nepovratno pokvari struktura datoteke. Isto tako, kod Paste metode koristite opciju Paste Special (Posebno lijepljenje), pa odaberite Vrijednosti (Value). Ni u kom slučaju ne prenosite krivo upisane iznose s jedne AOP pozicije na drugu tako da ih prenosite mišem. Isto tako, ne brišite postojeće radne listove, ne mijenjajte nazive postojećih, ne uključujte dijeljenje ili zaštitu radne knjige, ne ubacujte linkove na neke druge dokumente. S obzirom da su svi radni listovi međusobno povezani formulama koje služe kao kontrola, svaka od spomenutih radnji rezultira da Excel datoteka postane neupotrebljiva za računalnu obradu i morat ćete ispuniti novu datoteku."]
[null,"Kontrole obrazaca podijeljene su na općenite (kontrole popunjenosti pojedinih obrazaca, popunjenost zaglavlja, kontrole između obrazaca) te na kontrole na razini pojedinog obrasca. Općenite kontrole provjeravajte tek kada popunite sve obrasce koje ste dužni predati. Ako ste dužni predati neki obrazac (prema razdoblju predaje i razini), a niste ga popunili kontrola će na to upozoriti, isto tako, upozorit će ako ste popunili obrazac koji niste dužni predati. Kontrole na razini pojedinog obrasca provjeravajte nakon popunjavanja tog obrasca. Ako neka kontrola nije zadovoljena ispravite podatak. "]
[null,"Na referentnoj stranici pored imena svakog obrasca postoji stupac \"Kontroliran\" u kojem piše \"DA\" ako su sve kontrole zadovoljene, a ako nisu, umjesto teksta \"DA\" pojavljuje se broj kontrola na razini tog obrasca koje su još u grešci. Ako na Referentnoj stranici, pored imena nekog obrasca u stupcu \"Popunjen\" stoji \"NE\" eventualne kontrole na razini tog obrasca koje nisu zadovoljene možete zanemariti jer se taj obrazac neće ni učitati. Ako pored svakog obrasca piše da je kontroliran (\"DA\"), a i dalje na referentnoj stranici piše da obrazac nije ispravan, nije zadovoljena neka od općenitih kontrola."]
[null,"Oznaka \"DA\" na referentnoj stranici pored imena svakog obrasca pojavit će se nakon unosa barem jednog iznosa različitog od nule. To još uvijek ne znači da je taj obrazac potpun, i ispravan ali signalizira da je nešto upisano u taj obrazac, i smatra se da je korisnik i taj obrazac predao. Ne unosite iznose u obrasce koje niste dužni predati. Posebnost je obrazac P-VRIO, koji kod nekih obveznika može sadržavati sve nule, tj. nema niti jednu vrijednost različitu od nule. Kod obrasca P-VRIO oznaka \"DA\" ili \"NE\" ne dodjeljuje se automatski nego je mora upisati (ili odabrati s popisa) korisnik."]
[null,"Česta pogreška pri unosu je da nakon brisanja vrijednosti nekog AOP-a u ćeliji ostane upisan razmak koji se ne vidi na ekranu, kad se to dogodi, polje kontrolni broj na vrhu obrasca bit će popunjeno s vrijednošću #VRIJ ili #VALUE. U tom slučaju, ako ne uspijete pronaći na kojem AOP-u je upisan razmak ili neki drugi znak koji nije brojevna vrijednost, popunite sva polja koja nemaju podataka nulama."]
[null,"Važno: S obzirom da velik broj obveznika obrasce popunjava direktno iz svojih računovodstvenih aplikacija, prije dostavljanja takvog obrasca u poslovnicu FINA-e (bez obzira u kojem programu je popunjavan) neophodno je da tako popunjene obrasce otvore u Excel-u, te nakon toga neki od AOP-a ili neki od datuma razdoblja pobrišete i upišete ponovo, kako biste u Excel-u pokrenuli izračun formula jer vanjske aplikacije popune samo pojedinačna polja u obrascu i nemaju mogućnost da pokrenu i sve izračune i kontrole u obrascima. Znači, nakon što obrazac popuni vanjska aplikacija, te ga otvorite kako biste ispisali referentnu stranicu, pobrišite i ponovo upište recimo datum od i datum do razdoblja, te obavezno nakon ispisa te stranice snimite ponovo sve promjene u obrascu (kod izlaska iz Excel-a on Vas pita želite li snimiti promjene, treba obavezno odgovoriti sa Da. "]
[null,"Korisnici Open Office-a:  U vrijeme izrade obrasca zadnja aktualna verzija OpenOffice-a na hrvatskom jeziku je bila 4.2. Obrazac popunjen u ovoj verziji Open Office-a moguće je učitati u aplikaciju i s njim nije bilo problema u učitavanju. Koristite li starije verzije OpenOffice-a možete s Interneta besplatno skinuti zadnju verziju Open Officea, jer obrasci popunjeni u starijim verzijama mogli bi biti nečitki nakon predaje u FINA-u. Praksa je pokazala da neke verzije Excel-a ne rade dobro bez svih zakrpa (Service Pack-ova), zato provjerite s svojim informatičarima imate li na računalu instalirane sve zakrpe za program koji koristitie za popunjavanje. Korisnici Excel-a verzije 2007 i 2010, moraju prilikom snimanja Excel datoteke odabrati format 97-2003 jer najnoviji Excel format 2007 nije podržan. Prilikom prvog snimanja u ovoj novoj verziji Excel-a on će ponuditi konverziju u najnoviji format, pri tome treba odabrati da datoteka ostane u starom 97-2003 formatu, a ako ste pogreškom pretvorili u novi format 2007, potrebno je kroz opciju File (Datoteka), Save As (Snimi kao) ponovo snimiti u stariji format na način da se odabere format \"Radna knjiga Excela 97-2003\" ili \"Microsoft Excel 97-2003 workbook\" (na dnu prozora za snimanje)."]
[null,"Primijećeno je da se Excel datoteke često ne daju učitati jer sve formule nisu izračunate. Praksa je pokazala da se to puno rjeđe događa ako se obrazac prvo snimi, pa se onda izađe iz Excel-a (ili aplikacije za unos) nego ako se odabere izlaz iz aplikacije pa tek onda na poruku \"želite li snimiti promjene prilikom izlaska iz aplikacije\" odaberete \"snimi\". Zato pokušajte uvijek kad želite izaći iz datoteke koju popunjavate ili ste popunili, prvo izabrati snimi promjene, pa onda napustiti aplikaciju (bez snimanja promjena)."]
[null,"Imate li problema tehničke naravi s popunjavanjem obrasca, radom kontrola i slično, dostavite nam popunjenu problematičnu Excel datoteku zajedno s Vašim kontakt podacima te podacima o programu koji i koju verziju koristite za popunjavanje na adresu e-pošte: rgfi@fina.hr."]

{"sheet":"RefStr","index":2,"n_rows":722,"n_cols":11,"rows_kept":722,"cut":false,"hidden":false,"merged":[[3,0,3,10],[11,2,11,6],[5,3,5,4],[4,0,4,10],[5,9,5,10],[7,9,7,10],[0,6,0,8],[0,4,0,5],[0,2,0,3],[1,9,1,10],[0,0,0,1],[49,1,49,7],[0,9,0,10],[26,2,26,3],[13,1,13,6],[7,2,7,7],[37,1,37,7],[30,7,30,10],[32,2,32,3],[17,2,17,10],[19,2,19,10],[32,7,32,10],[28,7,28,10],[30,2,30,3],[62,0,62,3],[62,7,62,10],[9,1,9,8],[15,2,15,10],[39,1,39,7],[56,1,56,7],[40,1,40,7],[41,1,41,7],[42,1,42,7],[38,1,38,7],[57,1,57,7],[58,1,58,7],[21,2,21,10],[24,7,24,10],[23,3,23,5],[24,2,24,3],[28,2,28,3],[34,7,34,10],[50,1,50,7],[26,7,26,8],[38,0,41,0],[46,0,50,0],[51,0,54,0],[46,1,46,7],[47,1,47,7],[48,1,48,7],[52,1,52,7],[51,1,51,7],[24,0,32,0],[60,9,60,10],[42,0,45,0],[55,0,58,0],[45,1,45,7],[55,1,55,7],[44,1,44,7],[43,1,43,7],[53,1,53,7],[54,1,54,7]]}
["Novosti",null,"Uputa",null,"Kontrole",null,"Sifre",null,null,"Promjene"]
[null,null,null,null,null,null,null,{"$f":"LOOKUP(B22,A107:A663,C107:C663)","v":14},null,"Referentna stranica"]
[]
["Izvještaji proračuna, proračunskih i izvanproračunskih korisnika"]
[{"$f":"IF(AND(K10<>\"\",K12<>\"\"), \"za razdoblje: \" & TEXT(K10, \"d. mmmm yyyy.\") & \"   –   \" & TEXT(K12, \"d. mmmm yyyy.\"),\"za razdoblje od ________________ do ______________\")","v":"za razdoblje: 1. siječanj 2017.   –   31. prosinac 2017."}]
["Broj RKP-a:",9431,null,"AOP oznaka razdoblja:",null,"2017-12",null,null,null,{"$f":"SUM(Skriveni!G2:G1561)","v":110541620.27400006}]
[]
["Matični broj:",3392295,"Proračun nema korisnika pa Izvještaj vrijedi i kao konsolidirani:",null,null,null,null,null,"NE","Kontrolni broj izvještaja"]
[]
["Naziv obveznika:","OŠ MLADOST OSIJEK",null,null,null,null,null,null,null,"Od datuma:","2017-01-01"]
[]
["Pošta i mjesto:",31000,"OSIJEK",null,null,null,null,null,null,"Do datuma:","2017-12-31"]
[]
["Ulica i kućni broj:","SJENJAK 7",null,null,null,null,null,null,null,"OIB:",19998137302]
[]
["Razina:",31,{"$f":"IF(B16>0,LOOKUP(B16,A66:A74,B66:B74),\"Razina nije upisana\")","v":"Proračunski korisnik jedinice lokalne i područne (regionalne) samouprave koji obavlja poslove u sklopu funkcija koje se decentraliziraju"}]
[]
["Šifra djelatnosti:",8520,{"$f":" IF(B18>0,LOOKUP(B18,Sifre!A255:A869,Sifre!B255:B869),\"Djelatnost nije upisana\")","v":"Osnovno obrazovanje"}]
[]
["Razdjel:",0,{"$f":"IF(B20<>\"\",\"Razdjel: \" & LOOKUP(B20,A666:A713,B666:B713),\"Razdjel nije upisan\")","v":"Razdjel: NEMA RAZDJELA"}]
[]
["Šifra grada/opć.:",312,{"$f":"IF(B22>0, \"Županija: \" & LOOKUP(H2,A83:A103,B83:B103) & \", grad/općina: \" & LOOKUP(B22,A107:A663,B107:B663),\"Šifra grada/općine nije upisana\")","v":"Županija: OSIJEČKO-BARANJSKA, grad/općina: OSIJEK"}]
[]
[null,"Popunjen",null,"    Broj pogrešaka"]
["Pregled \npopunjenosti\nobrazaca:",{"$f":"IF(SUM(Skriveni!C2:F642)=0,\"NE\", \"DA\")","v":"DA"},"PR-RAS (VP 151)",null,{"$f":"IF(AND(B25=\"DA\",Kont!E23>0),Kont!E23,\"Nema\")","v":"Nema"},null,"Osoba za kontaktiranje:","Robertina Filić"]
[]
[null,{"$f":"IF(SUM(Skriveni!C977:D1225)<>0,\"DA\",\"NE\")","v":"DA"},"BIL (VP 152)",null,{"$f":"IF(AND(B27=\"DA\",Kont!E261>0),Kont!E261,\"Nema\")","v":"Nema"},null,"Telefon:","031496682",null,"Telefax:","031574913"]
[]
[null,{"$f":"IF(SUM(Skriveni!C1287:D1422)<>0,\"DA\",\"NE\")","v":"DA"},"RAS funkcijski (VP 154)",null,{"$f":"IF(AND(B29=\"DA\",Kont!E297>0),Kont!E297,\"Nema\")","v":"Nema"},null,"Adresa e-pošte za kontakt:","ured@os-mladost-os.skole.hr"]
[]
[null,"DA","P-VRIO (VP 156)",null,{"$f":"IF(Kont!E292>0,Kont!E292,\"Nema\")","v":"Nema"},null,"Adresa e-pošte obveznika:"]
[]
[null,{"$f":"IF(SUM(Skriveni!C1468:C1550)<>0,\"DA\",\"NE\")","v":"DA"},"Obveze (VP 159)",null,{"$f":"IF(AND(B33=\"DA\",Kont!E288>0),Kont!E288,\"Nema\")","v":"Nema"},null,"Zakonski predstavnik:","JOSIP JUKIĆ"]
[]
[null,null,null,null,null,null,"Stanje kontrola:",{"$f":"IF(Kont!E3>0,\"Izvještaj sadrži pogreške, broj pogrešaka: \" & Kont!E3,IF(J6=0,\"Izvještaj je prazan\",\"Izvještaj nema pogrešaka\"))","v":"Izvještaj nema pogrešaka"}]
[]
[]
["Obrazac","Opis stavke",null,null,null,null,null,null,"AOP\noznaka","Prethodna godina / početak godine","Tekuća godina / kraj godine"]
["PR-RAS",{"$f":"PRRAS!B12","v":"PRIHODI POSLOVANJA (AOP 002+039+045+074+105+123+130+136) "},null,null,null,null,null,null,{"$f":"PRRAS!C12","v":1},{"$f":"PRRAS!D12","v":7377585},{"$f":"PRRAS!E12","v":7821214}]
[null,{"$f":"PRRAS!B159","v":"RASHODI POSLOVANJA (AOP 149+160+193+212+221+246+257) "},null,null,null,null,null,null,{"$f":"PRRAS!C159","v":148},{"$f":"PRRAS!D159","v":7344045},{"$f":"PRRAS!E159","v":7840643}]
[null,{"$f":"PRRAS!B648","v":"Višak prihoda i primitaka raspoloživ u sljedećem razdoblju (AOP 631+633-632-634)"},null,null,null,null,null,null,{"$f":"PRRAS!C648","v":635},{"$f":"PRRAS!D648","v":85945},{"$f":"PRRAS!E648","v":12550}]
[null,{"$f":"PRRAS!B649","v":"Manjak prihoda i primitaka za pokriće u sljedećem razdoblju (AOP 632+634-631-633)"},null,null,null,null,null,null,{"$f":"PRRAS!C649","v":636},{"$f":"PRRAS!D649","v":0},{"$f":"PRRAS!E649","v":0}]
["Bilanca",{"$f":"Bil!B13","v":"Nefinancijska imovina (AOP 003+007+046+047+051+058)"},null,null,null,null,null,null,{"$f":"Bil!C13","v":2},{"$f":"Bil!D13","v":127017},{"$f":"Bil!E13","v":157138}]
[null,{"$f":"Bil!B74","v":"Financijska imovina (AOP 064+073+081+112+128+140+157+158)"},null,null,null,null,null,null,{"$f":"Bil!C74","v":63},{"$f":"Bil!D74","v":707100},{"$f":"Bil!E74","v":720697}]
[null,{"$f":"Bil!B174","v":"Obveze (AOP 164+175+176+192+220) "},null,null,null,null,null,null,{"$f":"Bil!C174","v":163},{"$f":"Bil!D174","v":613897},{"$f":"Bil!E174","v":699199}]
[null,{"$f":"Bil!B234","v":"Vlastiti izvori (224 + 232 - 236 + 240 do 242)"},null,null,null,null,null,null,{"$f":"Bil!C234","v":223},{"$f":"Bil!D234","v":220219},{"$f":"Bil!E234","v":178635}]
["RAS-funkcijski",{"$f":"RasF!B12","v":"Opće javne usluge (AOP 002+006+009+013 do 017)"},null,null,null,null,null,null,{"$f":"RasF!C12","v":1},{"$f":"RasF!D12","v":0},{"$f":"RasF!E12","v":0}]
[null,{"$f":"RasF!B42","v":"Ekonomski poslovi (AOP 032+035+039+046+050+056+057+062+070)"},null,null,null,null,null,null,{"$f":"RasF!C42","v":31},{"$f":"RasF!D42","v":0},{"$f":"RasF!E42","v":0}]
[null,{"$f":"RasF!B95","v":"Rashodi vezani za stanovanje i kom. pogodnosti koji nisu drugdje svrstani"},null,null,null,null,null,null,{"$f":"RasF!C95","v":84},{"$f":"RasF!D95","v":0},{"$f":"RasF!E95","v":0}]
[null,{"$f":"RasF!B121","v":"Obrazovanje (AOP 111+114+117+118+121 do 124)"},null,null,null,null,null,null,{"$f":"RasF!C121","v":110},{"$f":"RasF!D121","v":7358507},{"$f":"RasF!E121","v":7894608}]
[null,{"$f":"RasF!B148","v":"Kontrolni zbroj (AOP 001+018+024+031+071+078+085+103+110+125)"},null,null,null,null,null,null,{"$f":"RasF!C148","v":137},{"$f":"RasF!D148","v":7358507},{"$f":"RasF!E148","v":7894608}]
["P-VRIO",{"$f":"PVRIO!B12","v":"Promjene u vrijednosti i obujmu imovine (AOP 002+018)"},null,null,null,null,null,null,{"$f":"PVRIO!C12","v":1},{"$f":"PVRIO!D12","v":0},{"$f":"PVRIO!E12","v":35027}]
[null,{"$f":"PVRIO!B29","v":"Promjene u obujmu imovine (AOP 019+026)"},null,null,null,null,null,null,{"$f":"PVRIO!C29","v":18},{"$f":"PVRIO!D29","v":0},{"$f":"PVRIO!E29","v":35027}]
[null,{"$f":"PVRIO!B45","v":"Promjene u vrijednosti (revalorizacija) i obujmu obveza (AOP 035+040)"},null,null,null,null,null,null,{"$f":"PVRIO!C45","v":34},{"$f":"PVRIO!D45","v":0},{"$f":"PVRIO!E45","v":0}]
[null,{"$f":"PVRIO!B51","v":"Promjene u obujmu obveza (AOP 041 do 044)"},null,null,null,null,null,null,{"$f":"PVRIO!C51","v":40},{"$f":"PVRIO!D51","v":0},{"$f":"PVRIO!E51","v":0}]
["Obveze",{"$f":"Obv!B12","v":"Stanje obveza 1. siječnja (=AOP 036* iz Izvještaja o obvezama za prethodnu godinu)"},null,null,null,null,null,null,{"$f":"Obv!C12","v":1},"-",{"$f":"Obv!D12","v":597788}]
[null,{"$f":"Obv!B47","v":"Stanje obveza na kraju izvještajnog razdoblja (AOP 001+002-019) i (AOP 037+090)"},null,null,null,null,null,null,{"$f":"Obv!C47","v":36},"-",{"$f":"Obv!D47","v":691521}]
[null,{"$f":"Obv!B48","v":"Stanje dospjelih obveza na kraju izvještajnog razdoblja (AOP 038+043+079+084)"},null,null,null,null,null,null,{"$f":"Obv!C48","v":37},"-",{"$f":"Obv!D48","v":14900}]
[null,{"$f":"Obv!B101","v":"Stanje nedospjelih obveza na kraju izvještajnog razdoblja (AOP 091 do 094)"},null,null,null,null,null,null,{"$f":"Obv!C101","v":90},"-",{"$f":"Obv!D101","v":676621}]
[]
["U ___________________________________ dana _________________ 20____ godine.",null,null,null,null,null,null,null,null,{"$f":" \"Verzija Excel datoteke: \" & MID(Skriveni!K31,1,1) & \".\" & MID(Skriveni!K31,2,1) & \".\" & MID(Skriveni!K31,3,1) & \".\"","v":"Verzija Excel datoteke: 5.0.4."}]
[]
["(potpis voditelja računovodstva)",null,null,null,null,null,null,"(potpis odgovorne osobe)"]
[]
[]
[11,"Proračunski korisnik državnog proračuna i glava unutar nadležnog ministarstva"]
[12,"Nadležno ministarstvo/razdjel - konsolidirani izvještaj"]
[13,"Državni proračun"]
[21,"Proračunski korisnik jedinice lokalne i područne (regionalne) samouprave"]
[22,"Proračun jedinice lokalne i područne (regionalne) samouprave"]
[23,"Konsolidirani proračun jedinice lokalne i područne (regionalne) samouprave"]
[31,"Proračunski korisnik jedinice lokalne i područne (regionalne) samouprave koji obavlja poslove u sklopu funkcija koje se decentraliziraju"]
[41,"Izvanproračunski korisnik državnog proračuna"]
[42,"Izvanproračunski korisnik jedinice lokalne i područne (regionalne) samouprave"]
[]
["RAZD","OPIS2\nkvartal"]
[null,"za odabrano razdoblje i razinu obrazac se ne popunjava"]
["2017-03","za razdoblje 1. siječnja do 31. ožujka 2017. godine"]
["2017-06","za razdoblje 1. siječnja do 30. lipnja 2017. godine"]
["2017-09","za razdoblje 1. siječnja do 30. rujna 2017. godine"]
["2017-12","za razdoblje 1. siječnja do 31. prosinca 2017. godine"]
[]
[1,"ZAGREBAČKA"]
[2,"KRAPINSKO-ZAGORSKA"]
[3,"SISAČKO-MOSLAVAČKA"]
[4,"KARLOVAČKA"]
[5,"VARAŽDINSKA"]
[6,"KOPRIVNIČKO-KRIŽEVAČKA"]
[7,"BJELOVARSKO-BILOGORSKA"]
[8,"PRIMORSKO-GORANSKA"]
[9,"LIČKO-SENJSKA"]
[10,"VIROVITIČKO-PODRAVSKA"]
[11,"POŽEŠKO-SLAVONSKA"]
[12,"BRODSKO-POSAVSKA"]
[13,"ZADARSKA"]
[14,"OSIJEČKO-BARANJSKA"]
[15,"ŠIBENSKO-KNINSKA"]
[16,"VUKOVARSKO-SRIJEMSKA"]
[17,"SPLITSKO-DALMATINSKA"]
[18,"ISTARSKA"]
[19,"DUBROVAČKO-NERETVANSKA"]
[20,"MEĐIMURSKA"]
[21,"GRAD ZAGREB"]
[]
[]
[]
[1,"ANDRIJAŠEVCI",16,null,111]
[2,"ANTUNOVAC",14,null,112]
[3,"BABINA GREDA",16,null,113]
[4,"BAKAR",8,null,114]
[5,"BALE",18,null,115]
[6,"BARBAN",18,null,116]
[7,"BARILOVIĆI",4,null,119]
[8,"BAŠKA",8,null,121]
[9,"BAŠKA VODA",17,null,122]
[10,"BEBRINA",12,null,123]
[11,"BEDEKOVČINA",2,null,124]
[12,"BEDNJA",5,null,125]
[13,"BELI MANASTIR",14,null,125]
[15,"BELICA",20,null,126]
[16,"BELIŠĆE",14,null,127]
[17,"BENKOVAC",13,null,128]
[18,"BEREK",7,null,129]
[19,"BERETINEC",5,null,130]
[20,"BIBINJE",13,null,141]
[21,"BILJE",14,null,142]
[22,"BIOGRAD NA MORU",13,null,143]
[23,"BIZOVAC",14,null,144]
[24,"BJELOVAR",7,null,145]
[25,"BLATO",19,null,146]
[26,"BOGDANOVCI",16,null,147]
[27,"BOL",17,null,149]
[29,"BOROVO",16,null,150]
[30,"BOSILJEVO",4,null,161]
[32,"BOŠNJACI",16,null,162]
[33,"BRCKOVLJANI",1,null,163]
[34,"BRDOVEC",1,null,164]
[35,"BRESTOVAC",11,null,170]
[36,"BREZNICA",5,null,210]
[37,"BRINJE",9,null,220]
[38,"BROD MORAVICE",8,null,230]
[39,"BRODSKI STUPNIK",12,null,240]
[40,"BRTONIGLA",18,null,311]
[41,"BUDINŠČINA",2,null,312]
[42,"BUJE",18,null,321]
[43,"BUZET",18,null,322]
[44,"CERNA",16,null,510]
[46,"CERNIK",12,null,520]
[47,"CEROVLJE",18,null,610]
[48,"CESTICA",5,null,620]
[49,"CETINGRAD",4,null,710]
[50,"CISTA PROVO",17,null,721]
[51,"CIVLJANE",15,null,729]
[52,"CRES",8,null,811]
[53,"CRIKVENICA",8,null,812]
[54,"CRNAC",10,null,891]
[55,"ČABAR",8,null,892]
[56,"ČAČINCI",10,null,893]
[57,"ČAĐAVICA",10,null,899]
[58,"ČAGLIN",11,null,910]
[60,"ČAKOVEC",20,null,990]
[61,"ČAVLE",8,null,1011]
[63,"ČAZMA",7,null,1012]
[64,"ČEMINAC",14,null,1013]
[65,"ČEPIN",14,null,1020]
[66,"DARDA",14,null,1031]
[67,"DARUVAR",7,null,1032]
[68,"DAVOR",12,null,1039]
[69,"DELNICE",8,null,1041]
[70,"DESINIĆ",2,null,1042]
[71,"DEŽANOVAC",7,null,1051]
[72,"DICMO",17,null,1052]
[74,"DOBRINJ",8,null,1061]
[75,"DOMAŠINEC",20,null,1062]
[77,"BRELA",17,null,1071]
[78,"DONJA DUBRAVA",20,null,1072]
[79,"DONJA STUBICA",2,null,1073]
[80,"DONJA VOĆA",5,null,1081]
[81,"DONJI ANDRIJEVCI",12,null,1082]
[82,"DONJI KRALJEVEC",20,null,1083]
[83,"DONJI KUKURUZARI",3,null,1084]
[84,"DONJI LAPAC",9,null,1085]
[85,"DONJI MARTIJANEC",5,null,1086]
[86,"DONJI MIHOLJAC",14,null,1089]
[87,"MUĆ",17,null,1091]
[88,"PROLOŽAC",17,null,1092]
[89,"DONJI VIDOVEC",20,null,1101]
[90,"DRAGANIĆ",4,null,1102]
[91,"DRAŽ",14,null,1103]
[92,"DRENOVCI",16,null,1104]
[94,"DRENJE",14,null,1105]
[95,"DRNIŠ",15,null,1106]
[96,"DRNJE",6,null,1107]
[97,"DUBRAVA",1,null,1200]
[98,"DUBROVNIK",19,null,1310]
[99,"DUGA RESA",4,null,1320]
[100,"DUGI RAT",17,null,1330]
[101,"DUGO SELO",1,null,1391]
[102,"DVOR",3,null,1392]
[103,"ĐAKOVO",14,null,1393]
[104,"ĐELEKOVEC",6,null,1394]
[105,"ĐULOVAC",7,null,1395]
[106,"ĐURĐENOVAC",14,null,1396]
[107,"ĐURĐEVAC",6,null,1399]
[108,"ĐURMANEC",2,null,1411]
[110,"ERDUT",14,null,1412]
[111,"ERNESTINOVO",14,null,1413]
[113,"ERVENIK",15,null,1414]
[114,"FARKAŠEVAC",1,null,1419]
[115,"FERDINANDOVAC",6,null,1420]
[116,"FERIČANCI",14,null,1431]
[117,"FUŽINE",8,null,1439]
[118,"GARČIN",12,null,1511]
[119,"GAREŠNICA",7,null,1512]
[120,"GENERALSKI STOL",4,null,1520]
[121,"GLINA",3,null,1610]
[122,"GOLA",6,null,1621]
[123,"GORIČAN",20,null,1622]
[124,"GORJANI",14,null,1623]
[125,"GORNJA STUBICA",2,null,1624]
[127,"GORNJI BOGIĆEVCI",12,null,1629]
[129,"GORNJI KNEGINEC",5,null,1711]
[130,"GOSPIĆ",9,null,1712]
[131,"GRAČAC",13,null,1721]
[132,"GRAČIŠĆE",18,null,1722]
[133,"GRAD ZAGREB",21,null,1723]
[134,"GRADAC",17,null,1724]
[135,"GRADEC",1,null,1729]
[136,"GRADINA",10,null,1811]
[137,"GRADIŠTE",16,null,1812]
[138,"GROŽNJAN",18,null,1813]
[139,"GRUBIŠNO POLJE",7,null,1814]
[140,"GUNDINCI",12,null,1820]
[141,"GUNJA",16,null,1910]
[144,"HERCEGOVAC",7,null,1920]
[145,"HLEBINE",6,null,2011]
[146,"HRAŠĆINA",2,null,2012]
[148,"HRVACE",17,null,2013]
[149,"HRVATSKA DUBICA",3,null,2014]
[150,"HRVATSKA KOSTAJNICA",3,null,2015]
[151,"BREZNIČKI HUM",5,null,2016]
[152,"HUM NA SUTLI",2,null,2017]
[153,"HVAR",17,null,2020]
[154,"ILOK",16,null,2030]
[155,"IMOTSKI",17,null,2041]
[156,"IVANEC",5,null,2042]
[158,"IVANIĆ-GRAD",1,null,2051]
[159,"IVANKOVO",16,null,2052]
[161,"IVANSKA",7,null,2053]
[163,"JAKOVLJE",1,null,2059]
[164,"JAKŠIĆ",11,null,2060]
[165,"JALŽABET",5,null,2110]
[166,"JARMINA",16,null,2120]
[167,"JASENICE",13,null,2211]
[168,"JASENOVAC",3,null,2219]
[169,"JASTREBARSKO",1,null,2221]
[170,"JELENJE",8,null,2222]
[171,"JELSA",17,null,2223]
[172,"JOSIPDOL",4,null,2229]
[173,"KALI",13,null,2311]
[175,"KANFANAR",18,null,2312]
[176,"KAPELA",7,null,2313]
[177,"KAPTOL",11,null,2314]
[178,"KARLOBAG",9,null,2319]
[179,"KARLOVAC",4,null,2320]
[180,"KASTAV",8,null,2331]
[181,"KAŠTELA",17,null,2332]
[183,"KIJEVO",15,null,2341]
[184,"KISTANJE",15,null,2342]
[185,"KLAKAR",12,null,2343]
[186,"KLANA",8,null,2344]
[187,"KLANJEC",2,null,2349]
[189,"KLENOVNIK",5,null,2351]
[190,"KLINČA SELA",1,null,2352]
[192,"KLIS",17,null,2361]
[193,"KLOŠTAR IVANIĆ",1,null,2362]
[194,"KLOŠTAR PODRAVSKI",6,null,2363]
[195,"KNEŽEVI VINOGRADI",14,null,2364]
[196,"KNIN",15,null,2365]
[197,"KOMIŽA",17,null,2369]
[198,"KONAVLE",19,null,2370]
[199,"KONČANICA",7,null,2391]
[200,"KONJŠČINA",2,null,2399]
[201,"KOPRIVNICA",6,null,2410]
[202,"KOPRIVNIČKI BREGI",6,null,2420]
[203,"KOPRIVNIČKI IVANEC",6,null,2431]
[204,"KORČULA",19,null,2432]
[205,"KOŠKA",14,null,2433]
[206,"KOTORIBA",20,null,2434]
[208,"KRALJEVEC NA SUTLI",2,null,2441]
[209,"KRALJEVICA",8,null,2442]
[211,"KRAPINA",2,null,2443]
[212,"KRAPINSKE TOPLICE",2,null,2444]
[213,"KRIŽ",1,null,2445]
[214,"KRIŽEVCI",6,null,2446]
[215,"KRK",8,null,2451]
[216,"KRNJAK",4,null,2452]
[217,"KRŠAN",18,null,2453]
[219,"KULA NORINSKA",19,null,2454]
[220,"KUTINA",3,null,2511]
[221,"KUTJEVO",11,null,2512]
[222,"LABIN",18,null,2521]
[223,"LANIŠĆE",18,null,2529]
[225,"LASINJA",4,null,2530]
[226,"LASTOVO",19,null,2540]
[227,"LEGRAD",6,null,2550]
[228,"LEKENIK",3,null,2561]
[229,"LEPOGLAVA",5,null,2562]
[230,"LEVANJSKA VAROŠ",14,null,2571]
[231,"LIPIK",11,null,2572]
[232,"LIPOVLJANI",3,null,2573]
[234,"LIŠANE OSTROVIČKE",13,null,2591]
[235,"LIŽNJAN",18,null,2592]
[236,"LOBOR",2,null,2593]
[237,"LOKVE",8,null,2594]
[239,"LOVAS",16,null,2599]
[240,"LOVINAC",9,null,2611]
[242,"LOVRAN",8,null,2612]
[243,"LOVREĆ",17,null,2620]
[244,"LUDBREG",5,null,2630]
[245,"LUKAČ",10,null,2640]
[246,"LUPOGLAV",18,null,2651]
[247,"LJUBEŠĆICA",5,null,2652]
[248,"MAČE",2,null,2660]
[249,"MAKARSKA",17,null,2670]
[250,"MALA SUBOTICA",20,null,2680]
[251,"MALI BUKOVEC",5,null,2711]
[252,"MALI LOŠINJ",8,null,2712]
[253,"MALINSKA-DUBAŠNICA",8,null,2720]
[254,"MARČANA",18,null,2731]
[256,"MARIJA BISTRICA",2,null,2732]
[257,"MARIJANCI",14,null,2733]
[258,"MARINA",17,null,2740]
[259,"MARTINSKA VES",3,null,2751]
[260,"MARUŠEVEC",5,null,2752]
[261,"MATULJI",8,null,2790]
[263,"MEDULIN",18,null,2811]
[264,"METKOVIĆ",19,null,2812]
[265,"MIHOVLJAN",2,null,2813]
[266,"MIKLEUŠ",10,null,2814]
[267,"MILNA",17,null,2815]
[268,"MLJET",19,null,2821]
[270,"MOLVE",6,null,2822]
[271,"PODRAVSKA MOSLAVINA",14,null,2823]
[273,"MOŠĆENIČKA DRAGA",8,null,2824]
[274,"MOTOVUN",18,null,2825]
[275,"MRKOPALJ",8,null,2829]
[276,"MURSKO SREDIŠĆE",20,null,2830]
[278,"NAŠICE",14,null,2841]
[279,"NEDELIŠĆE",20,null,2849]
[280,"NEREŽIŠĆA",17,null,2891]
[281,"NETRETIĆ",4,null,2892]
[282,"NIN",13,null,2893]
[283,"NOVA BUKOVICA",10,null,2894]
[284,"NOVA GRADIŠKA",12,null,2895]
[285,"NOVA KAPELA",12,null,2896]
[287,"NOVA RAČA",7,null,2899]
[288,"NOVALJA",9,null,2910]
[289,"NOVI MAROF",5,null,2920]
[290,"NOVI VINODOLSKI",8,null,2931]
[291,"NOVIGRAD",18,null,2932]
[292,"NOVIGRAD PODRAVSKI",6,null,3011]
[293,"NOVSKA",3,null,3012]
[294,"NUŠTAR",16,null,3020]
[295,"NIJEMCI",16,null,3030]
[296,"OBROVAC",13,null,3040]
[297,"OGULIN",4,null,3091]
[298,"PROMINA",15,null,3092]
[299,"OKUČANI",12,null,3099]
[300,"OMIŠ",17,null,3101]
[301,"OMIŠALJ",8,null,3102]
[302,"OPATIJA",8,null,3103]
[303,"OPRISAVCI",12,null,3109]
[304,"OPRTALJ",18,null,3211]
[306,"OPUZEN",19,null,3212]
[307,"ORAHOVICA",10,null,3213]
[308,"OREBIĆ",19,null,3220]
[309,"ORIOVAC",12,null,3230]
[310,"BISKUPIJA",15,null,3240]
[311,"OROSLAVJE",2,null,3250]
[312,"OSIJEK",14,null,3291]
[313,"OTOČAC",9,null,3299]
[314,"OTOK",17,null,3311]
[315,"OZALJ",4,null,3312]
[316,"PAG",13,null,3313]
[317,"PAKOŠTANE",13,null,3314]
[318,"PAKRAC",11,null,3315]
[320,"PAŠMAN",13,null,3316]
[321,"PAZIN",18,null,3317]
[323,"PERUŠIĆ",9,null,3319]
[324,"PETERANEC",6,null,3320]
[325,"PETLOVAC",14,null,3511]
[326,"PETRIJANEC",5,null,3512]
[327,"PETRIJEVCI",14,null,3513]
[328,"PETRINJA",3,null,3514]
[329,"PETROVSKO",2,null,3521]
[330,"PIĆAN",18,null,3522]
[331,"PISAROVINA",1,null,3523]
[332,"PITOMAČA",10,null,3530]
[333,"PLAŠKI",4,null,3600]
[334,"PLETERNICA",11,null,3700]
[335,"PLOČE",19,null,3811]
[337,"PODBABLJE",17,null,3812]
[338,"PODCRKAVLJE",12,null,3821]
[339,"PODGORA",17,null,3822]
[340,"PODGORAČ",14,null,3831]
[341,"PODSTRANA",17,null,3832]
[342,"PODTUREN",20,null,3900]
[343,"POJEZERJE",19,null,4110]
[344,"POLAČA",13,null,4120]
[345,"POLIČNIK",13,null,4211]
[346,"POPOVAC",14,null,4212]
[347,"POPOVAČA",3,null,4213]
[348,"POREČ",18,null,4221]
[349,"POSEDARJE",13,null,4222]
[350,"POSTIRA",17,null,4291]
[351,"POŽEGA",11,null,4299]
[352,"PREGRADA",2,null,4311]
[354,"PREKO",13,null,4312]
[355,"PRELOG",20,null,4313]
[356,"PRESEKA",1,null,4321]
[357,"PRIMOŠTEN",15,null,4322]
[358,"PUČIŠĆA",17,null,4329]
[359,"PULA",18,null,4331]
[360,"PUNAT",8,null,4332]
[361,"PUNITOVCI",14,null,4333]
[362,"PUŠĆA",1,null,4334]
[363,"RAB",8,null,4339]
[364,"RADOBOJ",2,null,4391]
[365,"RAKOVICA",4,null,4399]
[366,"RASINJA",6,null,4511]
[368,"RAŠA",18,null,4519]
[369,"RAVNA GORA",8,null,4520]
[371,"RAŽANAC",13,null,4531]
[372,"REŠETARI",12,null,4532]
[373,"RIJEKA",8,null,4540]
[374,"ROVINJ",18,null,4611]
[375,"ROVIŠĆE",7,null,4612]
[376,"RUGVICA",1,null,4613]
[377,"RUŽIĆ",15,null,4614]
[378,"SABORSKO",4,null,4615]
[379,"SALI",13,null,4616]
[380,"SAMOBOR",1,null,4617]
[381,"SATNICA ĐAKOVAČKA",14,null,4618]
[382,"SEGET",17,null,4619]
[383,"SELCA",17,null,4621]
[385,"SELNICA",20,null,4622]
[386,"SEMELJCI",14,null,4623]
[387,"SENJ",9,null,4624]
[388,"SIBINJ",12,null,4631]
[389,"SINJ",17,null,4632]
[390,"SIRAČ",7,null,4633]
[391,"SISAK",3,null,4634]
[393,"SKRAD",8,null,4635]
[394,"SKRADIN",15,null,4636]
[395,"SLATINA",10,null,4637]
[396,"SLAVONSKI BROD",12,null,4638]
[397,"SLAVONSKI ŠAMAC",12,null,4639]
[399,"SLIVNO",19,null,4641]
[400,"SLUNJ",4,null,4642]
[402,"SMOKVICA",19,null,4643]
[405,"SOKOLOVAC",6,null,4644]
[406,"SOLIN",17,null,4645]
[407,"SOPJE",10,null,4646]
[409,"SPLIT",17,null,4647]
[410,"SRAČINEC",5,null,4648]
[411,"STANKOVCI",13,null,4649]
[412,"STARA GRADIŠKA",12,null,4651]
[413,"STARI GRAD",17,null,4652]
[414,"STARI JANKOVCI",16,null,4661]
[415,"STARI MIKANOVCI",16,null,4662]
[416,"STARIGRAD",13,null,4663]
[418,"STARO PETROVO SELO",12,null,4664]
[419,"STON",19,null,4665]
[421,"STRIZIVOJNA",14,null,4666]
[422,"STUBIČKE TOPLICE",2,null,4669]
[423,"SUĆURAJ",17,null,4671]
[424,"SUHOPOLJE",10,null,4672]
[425,"SUKOŠAN",13,null,4673]
[426,"SUNJA",3,null,4674]
[427,"SUPETAR",17,null,4675]
[428,"SVETI FILIP I JAKOV",13,null,4676]
[429,"SVETI IVAN ZELINA",1,null,4677]
[430,"SVETI KRIŽ ZAČRETJE",2,null,4690]
[431,"SVETI LOVREČ",18,null,4711]
[432,"SVETA NEDELJA",18,null,4719]
[433,"SVETI PETAR U ŠUMI",18,null,4721]
[435,"SVETVINČENAT",18,null,4722]
[436,"SVETA NEDJELJA",1,null,4723]
[437,"SVETI ĐURĐ",5,null,4724]
[438,"SVETI ILIJA",5,null,4725]
[439,"SVETI IVAN ŽABNO",6,null,4726]
[440,"SVETI JURAJ NA BREGU",20,null,4729]
[441,"SVETI MARTIN NA MURI",20,null,4730]
[442,"SVETI PETAR OREHOVEC",6,null,4741]
[443,"ŠESTANOVAC",17,null,4742]
[444,"ŠIBENIK",15,null,4743]
[445,"ŠKABRNJE",13,null,4751]
[447,"ŠOLTA",17,null,4752]
[449,"ŠPIŠIĆ BUKOVICA",10,null,4753]
[450,"ŠTEFANJE",7,null,4754]
[452,"ŠTRIGOVA",20,null,4759]
[453,"TINJAN",18,null,4761]
[454,"TISNO",15,null,4762]
[455,"PLITVIČKA JEZERA",9,null,4763]
[456,"TOMPOJEVCI",16,null,4764]
[457,"TOPUSKO",3,null,4765]
[458,"TORDINCI",16,null,4771]
[459,"TOVARNIK",16,null,4772]
[460,"TRILJ",17,null,4773]
[461,"TRNAVA",14,null,4774]
[462,"TRNOVEC BARTOLOVEČKI",5,null,4775]
[463,"TROGIR",17,null,4776]
[464,"TRPINJA",16,null,4777]
[466,"TUHELJ",2,null,4778]
[467,"UDBINA",9,null,4779]
[468,"UMAG",18,null,4781]
[469,"UNEŠIĆ",15,null,4782]
[471,"VALPOVO",14,null,4789]
[472,"VARAŽDIN",5,null,4791]
[473,"VARAŽDINSKE TOPLICE",5,null,4799]
[474,"VELA LUKA",19,null,4910]
[475,"VELIKA",11,null,4920]
[476,"VELIKA KOPANICA",12,null,4931]
[477,"VELIKA LUDINA",3,null,4932]
[478,"VELIKA PISANICA",7,null,4939]
[480,"VELIKI GRĐEVAC",7,null,4941]
[481,"VELIKO TRGOVIŠĆE",2,null,4942]
[483,"VELIKO TROJSTVO",7,null,4950]
[484,"VIDOVEC",5,null,5010]
[485,"VILJEVO",14,null,5020]
[486,"VINICA",5,null,5030]
[487,"VINKOVCI",16,null,5040]
[488,"VINODOLSKA OPĆINA",8,null,5110]
[489,"VIR",13,null,5121]
[490,"VIRJE",6,null,5122]
[491,"VIROVITICA",10,null,5210]
[492,"VIS",17,null,5221]
[493,"VISOKO",5,null,5222]
[494,"VIŠKOVCI",14,null,5223]
[495,"VIŠKOVO",8,null,5224]
[497,"VIŠNJAN",18,null,5229]
[498,"VIŽINADA",18,null,5310]
[499,"VOĆIN",10,null,5320]
[500,"VODICE",15,null,5510]
[502,"VODNJAN",18,null,5520]
[503,"VOJNIĆ",4,null,5530]
[504,"VRATIŠINEC",20,null,5590]
[505,"VRBANJA",16,null,5610]
[506,"VRBJE",12,null,5621]
[507,"VRBNIK",8,null,5629]
[508,"VRBOVEC",1,null,5630]
[509,"VRBOVSKO",8,null,5811]
[510,"GVOZD",3,null,5812]
[511,"VRGORAC",17,null,5813]
[512,"VRHOVINE",9,null,5814]
[513,"VRLIKA",17,null,5819]
[514,"VRPOLJE",12,null,5821]
[516,"VRSAR",18,null,5829]
[517,"VUKA",14,null,5911]
[518,"VUKOVAR",16,null,5912]
[519,"ZABOK",2,null,5913]
[520,"ZADAR",13,null,5914]
[521,"ZAGORSKA SELA",2,null,5920]
[522,"ZAGVOZD",17,null,6010]
[523,"ZAŽABLJE",19,null,6020]
[524,"ZDENCI",10,null,6110]
[525,"ZEMUNIK DONJI",13,null,6120]
[526,"ZLATAR",2,null,6130]
[527,"ZLATAR-BISTRICA",2,null,6190]
[528,"ZMIJAVCI",17,null,6201]
[530,"ŽAKANJE",4,null,6202]
[531,"ŽMINJ",18,null,6203]
[533,"KRAŠIĆ",1,null,6209]
[534,"ŽUPANJA",16,null,6311]
[535,"OTOK (VINKOVCI)",16,null,6312]
[536,"RAKOVEC",1,null,6391]
[537,"NOVIGRAD",13,null,6399]
[538,"KOSTRENA",8,null,6411]
[539,"MARIJA GORICA",1,null,6419]
[540,"ŽUMBERAK",1,null,6420]
[541,"VELIKA GORICA",1,null,6430]
[542,"ORLE",1,null,6491]
[543,"ZAPREŠIĆ",1,null,6492]
[544,"POKUPSKO",1,null,6499]
[545,"KRAVARSKO",1,null,6511]
[547,"BISTRA",1,null,6512]
[548,"LUKA",1,null,6520]
[549,"DUBRAVICA",1,null,6530]
[550,"BEDENICA",1,null,6611]
[551,"STUPNIK",1,null,6612]
[552,"JESENJE",2,null,6619]
[553,"KUMROVEC",2,null,6621]
[554,"NOVI GOLUBOVEC",2,null,6622]
[555,"MAJUR",3,null,6629]
[556,"RIBNIK",4,null,6630]
[557,"TOUNJ",4,null,6810]
[558,"VELIKI BUKOVEC",5,null,6820]
[559,"KALINOVAC",6,null,6831]
[560,"KALNIK",6,null,6832]
[561,"NOVO VIRJE",6,null,6910]
[562,"SEVERIN",7,null,6920]
[564,"ŠANDROVAC",7,null,7010]
[565,"VELIKA TRNOVITICA",7,null,7021]
[566,"ZRINSKI TOPOLOVAC",7,null,7022]
[567,"BUKOVLJE",12,null,7111]
[568,"DRAGALIĆ",12,null,7112]
[569,"GORNJA VRBA",12,null,7120]
[570,"SIKIREVCI",12,null,7211]
[571,"GALOVAC",13,null,7219]
[572,"KUKLJICA",13,null,7220]
[573,"POVLJANA",13,null,7311]
[574,"PRIVLAKA",13,null,7312]
[575,"TKON",13,null,7320]
[576,"DONJA MOTIČINA",14,null,7410]
[578,"MAGADENOVAC",14,null,7420]
[579,"VLADISLAVCI",14,null,7430]
[581,"PIROVAC",15,null,7490]
[582,"ROGOZNICA",15,null,7500]
[583,"PRIVLAKA",16,null,7711]
[584,"VOĐINCI",16,null,7712]
[585,"DUGOPOLJE",17,null,7721]
[586,"LEĆEVICA",17,null,7722]
[587,"LOKVIČIĆI",17,null,7729]
[588,"OKRUG",17,null,7731]
[589,"PRGOMET",17,null,7732]
[590,"PRIMORSKI DOLAC",17,null,7733]
[591,"RUNOVIĆI",17,null,7734]
[592,"SUTIVAN",17,null,7735]
[593,"TUČEPI",17,null,7739]
[595,"ZADVARJE",17,null,7740]
[596,"KAROJBA",18,null,7810]
[597,"KAŠTELIR - LABINCI",18,null,7820]
[598,"DUBROVAČKO PRIMORJE",19,null,7830]
[599,"JANJINA",19,null,7911]
[600,"LUMBARDA",19,null,7912]
[601,"TRPANJ",19,null,7990]
[602,"ŽUPA DUBROVAČKA",19,null,8010]
[603,"DEKANOVEC",20,null,8020]
[604,"GORNJI MIHALJEVEC",20,null,8030]
[605,"OREHOVICA",20,null,8110]
[606,"STRAHONINEC",20,null,8121]
[607,"SVETA MARIJA",20,null,8122]
[608,"ŠENKOVEC",20,null,8129]
[609,"JAGODNJAK",14,null,8130]
[610,"MARKUŠICA",16,null,8211]
[612,"NEGOSLAVCI",16,null,8219]
[614,"ŠODOLOVCI",14,null,8220]
[616,"PODRAVSKE SESVETE",6,null,8230]
[617,"MURTER",15,null,8291]
[618,"GORNJA REKA",6,null,8292]
[619,"FAŽANA",18,null,8299]
[620,"PRIBISLAVEC",20,null,8411]
[621,"BILICE",15,null,8412]
[622,"KOLAN",13,null,8413]
[623,"KAMANJE",4,null,8421]
[624,"LOPAR",8,null,8422]
[625,"VRSI",13,null,8423]
[626,"TRIBUNJ",15,null,8424]
[628,"ŠTITAR",16,null,8425]
[629,"FUNTANA",18,null,8430]
[631,"TAR-VABRIGA",18,null,8510]
[710,"GRAD ZAGREB (ZAGREBAČKA ŽUPANIJA)",1,null,8520]
[null,null,null,null,8531]
[null,null,null,null,8532]
[0,"NEMA RAZDJELA",null,null,8541]
[10,"HRVATSKI SABOR",null,null,8542]
[12,"DRŽAVNO IZBORNO POVJERENSTVO REPUBLIKE HRVATSKE",null,null,8551]
[15,"URED PREDSJEDNICE REPUBLIKE HRVATSKE",null,null,8552]
[17,"USTAVNI SUD REPUBLIKE HRVATSKE",null,null,8553]
[18,"AGENCIJA ZA ZAŠTITU TRŽIŠNOG NATJECANJA",null,null,8559]
[20,"VLADA REPUBLIKE HRVATSKE",null,null,8560]
[25,"MINISTARSTVO FINANCIJA",null,null,8610]
[27,"RH SIGURNOSNO-OBAVJEŠTAJNA AGENCIJA",null,null,8621]
[28,"DRŽAVNI URED ZA SREDIŠNJU JAVNU NABAVU",null,null,8622]
[30,"MINISTARSTVO OBRANE",null,null,8623]
[32,"DRŽAVNI URED ZA HRVATE IZVAN REPUBLIKE HRVATSKE",null,null,8690]
[33,"DRŽAVNI URED ZA OBNOVU I STAMBENO ZBRINJAVANJE",null,null,8710]
[34,"SREDIŠNJI DRŽAVNI URED ZA RAZVOJ DIGITALNOG DRUŠTVA",null,null,8720]
[36,"SREDIŠNJI DRŽAVNI URED ZA ŠPORT",null,null,8730]
[40,"MINISTARSTVO UNUTARNJIH POSLOVA",null,null,8790]
[41,"MINISTARSTVO HRVATSKIH BRANITELJA",null,null,8810]
[48,"MINISTARSTVO VANJSKIH I EUROPSKIH POSLOVA",null,null,8891]
[49,"MINISTARSTVO GOSPODARSTVA, PODUZETNIŠTVA I OBRTA",null,null,8899]
[52,"POVJERENSTVO ZA ODLUČIVANJE O SUKOBU INTERESA",null,null,9001]
[54,"MINISTARSTVO DRŽAVNE IMOVINE",null,null,9002]
[55,"MINISTARSTVO KULTURE",null,null,9003]
[60,"MINISTARSTVO POLJOPRIVREDE",null,null,9004]
[61,"MINISTARSTVO REGIONALNOGA RAZVOJA I FONDOVA EUROPSKE UNIJE",null,null,9101]
[65,"MINISTARSTVO MORA, PROMETA I INFRASTRUKTURE",null,null,9102]
[76,"MINISTARSTVO GRADITELJSTVA I PROSTORNOGA UREĐENJA",null,null,9103]
[77,"MINISTARSTVO ZAŠTITE OKOLIŠA I ENERGETIKE",null,null,9104]
[80,"MINISTARSTVO ZNANOSTI I OBRAZOVANJA",null,null,9200]
[86,"MINISTARSTVO RADA I MIROVINSKOGA SUSTAVA",null,null,9311]
[90,"MINISTARSTVO TURIZMA",null,null,9312]
[95,"MINISTARSTVO UPRAVE",null,null,9313]
[96,"MINISTARSTVO ZDRAVSTVA",null,null,9319]
[102,"MINISTARSTVO ZA DEMOGRAFIJU, OBITELJ, MLADE I SOC. POLITIKU",null,null,9321]
[106,"HRVATSKA AKADEMIJA ZNANOSTI I UMJETNOSTI",null,null,9329]
[110,"MINISTARSTVO PRAVOSUĐA",null,null,9411]
[120,"URED PUČKOG PRAVOBRANITELJA",null,null,9412]
[121,"PRAVOBRANITELJ ZA DJECU",null,null,9420]
[122,"PRAVOBRANITELJ/ICA ZA RAVNOPRAVNOST SPOLOVA",null,null,9491]
[123,"PRAVOBRANITELJ ZA OSOBE S INVALIDITETOM",null,null,9492]
[160,"DRŽAVNI ZAVOD ZA STATISTIKU",null,null,9499]
[185,"DRŽAVNI URED ZA REVIZIJU",null,null,9511]
[196,"DRŽAVNA KOMISIJA ZA KONTROLU POSTUPAKA JAVNE NABAVE",null,null,9512]
[240,"URED VIJEĆA ZA NACIONALNU SIGURNOST",null,null,9521]
[241,"OPERATIVNO-TEHNIČKI CENTAR ZA NADZOR TELEKOMUNIKACIJA",null,null,9522]
[242,"ZAVOD ZA SIGURNOST INFORMACIJSKIH SUSTAVA",null,null,9523]
[250,"AGENCIJA ZA ZAŠTITU OSOBNIH PODATAKA",null,null,9524]
[256,"DRŽAVNI ZAVOD ZA RADIOLOŠKU I NUKLEARNU SIGURNOST",null,null,9525]
[258,"POVJERENIK ZA INFORMIRANJE",null,null,9529]
[null,null,null,null,9601]
[null,null,null,null,9602]
[null,null,null,null,9603]
[null,null,null,null,9604]
[null,null,null,null,9609]
[null,null,null,null,9700]
[null,null,null,null,9810]
[null,null,null,null,9820]
[null,null,null,null,9900]

{"sheet":"PRRAS","index":3,"n_rows":997,"n_cols":6,"rows_kept":997,"cut":false,"hidden":false,"merged":[[0,0,0,1],[1,4,1,5],[0,2,0,5],[1,0,1,3],[5,1,5,5],[3,1,3,3],[4,1,4,3],[3,4,3,5],[4,4,4,5],[2,0,2,3],[993,3,993,4],[10,0,10,1],[299,0,299,1],[421,0,421,1],[650,0,650,1],[6,1,6,5],[981,0,981,1]]}
["<–––– Povratak na RefStr",null,"Kontrole obrasca PR-RAS ––––>"]
["IZVJEŠTAJ O PRIHODIMA I RASHODIMA, PRIMICIMA I IZDACIMA",null,null,null,"Obrazac PR-RAS\nVP 151"]
[{"$f":"\"za razdoblje \"&IF(RefStr!K10=\"\",\"________________\",TEXT(RefStr!K10,\"d.mmmm yyyy.\")&\" do \"&IF(RefStr!K12=\"\",\"______________\",TEXT(RefStr!K12,\"d. mmmm yyyy.\")))","v":"za razdoblje 1.siječanj 2017. do 31. prosinac 2017."}]
["Obveznik:",{"$f":"\"RKP: \"&IF(RefStr!B6<>\"\",TEXT(INT(VALUE(RefStr!B6)),\"00000\"),\"_____\"&\",  \"&\"MB: \"&IF(RefStr!B8<>\"\",TEXT(INT(VALUE(RefStr!B8)),\"00000000\"),\"________\")&\"  OIB: \"&IF(RefStr!K14<>\"\",RefStr!K14,\"___________\"))","v":"RKP: 09431"},null,null,{"$f":"SUM(Skriveni!G2:G976)","v":95496472.04400003}]
[null,{"$f":"\"Naziv: \"&IF(RefStr!B10<>\"\",RefStr!B10,\"_______________________________________\")","v":"Naziv: OŠ MLADOST OSIJEK"},null,null,"Kontrolni broj obrasca"]
[null,{"$f":" \"Razina: \" & RefStr!B16 & \", Razdjel: \" & TEXT(INT(VALUE(RefStr!B20)), \"000\")","v":"Razina: 31, Razdjel: 000"}]
[null,{"$f":"\"Djelatnost: \" & RefStr!B18 & \" \" & RefStr!C18","v":"Djelatnost: 8520 Osnovno obrazovanje"}]
[null,null,null,null,null,"iznosi u kunama, bez lipa"]
["Račun iz rač. plana","Naziv stavke","AOP","Ostvareno u izvještajnom razdoblju preth. godine","Ostvareno u izvještajnom razdoblju \ntekuće godine","Indeks\n(5/4)"]
[1,2,3,4,5,6]
["Prihodi i rashodi poslovanja"]
[6,"PRIHODI POSLOVANJA (AOP 002+039+045+074+105+123+130+136) ",1,{"$f":"D13+D50+D56+D85+D116+D134+D141+D147","v":7377585},{"$f":"E13+E50+E56+E85+E116+E134+E141+E147","v":7821214},{"$f":"IF(D12<>0,IF(E12/D12>=100,\">>100\",E12/D12*100),\"-\")","v":106.01320079673768}]
[61,"Prihodi od poreza (AOP 003+012+018+024+032+035)",2,{"$f":"D14+D23+D29+D35+D43+D46","v":0},{"$f":"E14+E23+E29+E35+E43+E46","v":0},{"$f":"IF(D13<>0,IF(E13/D13>=100,\">>100\",E13/D13*100),\"-\")","v":"-"}]
[611,"Porez i prirez na dohodak (AOP 004 do 009 - 010 - 011)",3,{"$f":"SUM(D15:D20)-D21-D22","v":0},{"$f":"SUM(E15:E20)-E21-E22","v":0},{"$f":"IF(D14<>0,IF(E14/D14>=100,\">>100\",E14/D14*100),\"-\")","v":"-"}]
[6111,"Porez i prirez na dohodak od nesamostalnog rada",4,null,null,"-"]
[6112,"Porez i prirez na dohodak od samostalnih djelatnosti",5,null,null,"-"]
[6113,"Porez i prirez na dohodak od imovine i imovinskih prava",6,null,null,"-"]
[6114,"Porez i prirez na dohodak od kapitala",7,null,null,"-"]
[6115,"Porez i prirez na dohodak po godišnjoj prijavi",8,null,null,"-"]
[6116,"Porez i prirez na dohodak utvrđen u postupku nadzora za prethodne godine ",9,null,null,"-"]
[6117,"Povrat poreza i prireza na dohodak po godišnjoj prijavi",10,null,null,"-"]
[6119,"Povrat više ostvarenog poreza na dohodak za decentralizirane funkcije",11,null,null,"-"]
[612,"Porez na dobit (AOP 013 do 016 - 017)",12,{"$f":"SUM(D24:D27)-D28","v":0},{"$f":"SUM(E24:E27)-E28","v":0},"-"]
[6121,"Porez na dobit od poduzetnika",13,null,null,"-"]
[6122,"Porez na dobit po odbitku na naknade za korištenje prava i za usluge",14,null,null,"-"]
[6123,"Porez na dobit po odbitku na kamate, dividende i udjele u dobiti",15,null,null,"-"]
[6124,"Porez na dobit po godišnjoj prijavi",16,null,null,"-"]
[6125,"Povrat poreza na dobit po godišnjoj prijavi",17,null,null,"-"]
[613,"Porezi na imovinu (AOP 019 do 023)",18,{"$f":"SUM(D30:D34)","v":0},{"$f":"SUM(E30:E34)","v":0},"-"]
[6131,"Stalni porezi na nepokretnu imovinu",19,null,null,"-"]
[6132,"Porez na nasljedstva i darove",20,null,null,"-"]
[6133,"Porez na kapitalne i financijske transakcije",21,null,null,"-"]
[6134,"Povremeni porezi na imovinu",22,null,null,"-"]
[6135,"Ostali stalni porezi na imovinu",23,null,null,"-"]
[614,"Porezi na robu i usluge (AOP 025 do 031) ",24,{"$f":"SUM(D36:D42)","v":0},{"$f":"SUM(E36:E42)","v":0},"-"]
[6141,"Porez na dodanu vrijednost",25,null,null,"-"]
[6142,"Porez na promet",26,null,null,"-"]
[6143,"Posebni porezi i trošarine ",27,null,null,"-"]
[6145,"Porezi na korištenje dobara ili izvođenje aktivnosti",28,null,null,"-"]
[6146,"Ostali porezi na robu i usluge",29,null,null,"-"]
[6147,"Porez na dobitke od igara na sreću i ostali porezi od igara na sreću",30,null,null,"-"]
[6148,"Naknade za priređivanje igara na sreću",31,null,null,"-"]
[615,"Porezi na međunarodnu trgovinu i transakcije (AOP 033+034)",32,{"$f":"SUM(D44:D45)","v":0},{"$f":"SUM(E44:E45)","v":0},"-"]
[6151,"Carine i carinske pristojbe",33,null,null,"-"]
[6152,"Ostali porezi na međunarodnu trgovinu i transakcije",34,null,null,"-"]
[616,"Ostali prihodi od poreza (AOP 036 do 038)",35,{"$f":"SUM(D47:D49)","v":0},{"$f":"SUM(E47:E49)","v":0},"-"]
[6161,"Ostali prihodi od poreza koje plaćaju pravne osobe",36,null,null,"-"]
[6162,"Ostali prihodi od poreza koje plaćaju fizičke osobe",37,null,null,"-"]
[6163,"Ostali neraspoređeni prihodi od poreza",38,null,null,"-"]
[62,"Doprinosi (AOP 040+043+044)",39,{"$f":"D51+D54+D55","v":0},{"$f":"E51+E54+E55","v":0},"-"]
[621,"Doprinosi za zdravstveno osiguranje (AOP 041+042) ",40,{"$f":"SUM(D52:D53)","v":0},{"$f":"SUM(E52:E53)","v":0},"-"]
[6211,"Doprinosi za obvezno zdravstveno osiguranje ",41,null,null,"-"]
[6212,"Doprinosi za obvezno zdravstveno osiguranje za slučaj ozljede na radu",42,null,null,"-"]
[622,"Doprinosi za mirovinsko osiguranje",43,null,null,"-"]
[623,"Doprinosi za zapošljavanje",44,null,null,"-"]
[63,"Pomoći iz inozemstva i od subjekata unutar općeg proračuna \n(AOP 046+049+054+057+060+063+066+069)",45,{"$f":"D57+D60+D65+D68+D71+D74+D77+D80","v":5905381},{"$f":"E57+E60+E65+E68+E71+E74+E77+E80","v":6257250},105.95844705024113]
[631,"Pomoći od inozemnih vlada (AOP 047+048)",46,{"$f":"D58+D59","v":0},{"$f":"E58+E59","v":0},"-"]
[6311,"Tekuće pomoći od inozemnih vlada",47,null,null,"-"]
[6312,"Kapitalne pomoći od inozemnih vlada",48,null,null,"-"]
[632,"Pomoći od međunarodnih organizacija te institucija i tijela EU (AOP 050 do 053)",49,{"$f":"SUM(D61:D64)","v":0},{"$f":"SUM(E61:E64)","v":0},"-"]
[6321,"Tekuće pomoći od međunarodnih organizacija",50,null,null,"-"]
[6322,"Kapitalne pomoći od međunarodnih organizacija",51,null,null,"-"]
[6323,"Tekuće pomoći od institucija i tijela EU",52,null,null,"-"]
[6324,"Kapitalne pomoći od institucija i tijela EU",53,null,null,"-"]
[633,"Pomoći proračunu iz drugih proračuna (AOP 055+056)",54,{"$f":"SUM(D66:D67)","v":3366},{"$f":"SUM(E66:E67)","v":0},0]
[6331,"Tekuće pomoći proračunu iz drugih proračuna ",55,3366,null,0]
[6332,"Kapitalne pomoći proračunu iz drugih proračuna ",56,null,null,"-"]
[634,"Pomoći od izvanproračunskih korisnika (AOP 058+059)",57,{"$f":"SUM(D69:D70)","v":0},{"$f":"SUM(E69:E70)","v":0},"-"]
[6341,"Tekuće pomoći od izvanproračunskih korisnika",58,null,null,"-"]
[6342,"Kapitalne pomoći od izvanproračunskih korisnika ",59,null,null,"-"]
[635,"Pomoći izravnanja za decentralizirane funkcije (AOP 061+062)",60,{"$f":"SUM(D72:D73)","v":0},{"$f":"SUM(E72:E73)","v":0},"-"]
[6351,"Tekuće pomoći izravnanja za decentralizirane funkcije",61,null,null,"-"]
[6352,"Kapitalne pomoći izravnanja za decentralizirane funkcije",62,null,null,"-"]
["636","Pomoći proračunskim korisnicima iz proračuna koji im nije nadležan (AOP 064+065)",63,{"$f":"SUM(D75:D76)","v":5902015},{"$f":"SUM(E75:E76)","v":6257250},106.01887660400729]
["6361","Tekuće pomoći proračunskim korisnicima iz proračuna koji im nije nadležan",64,5902015,6257250,106.01887660400729]
["6362","Kapitalne pomoći proračunskim korisnicima iz proračuna koji im nije nadležan",65,null,null,"-"]
["638","Pomoći temeljem prijenosa  EU sredstava (AOP 067+068)",66,{"$f":"SUM(D78:D79)","v":0},{"$f":"SUM(E78:E79)","v":0},"-"]
["6381","Tekuće pomoći temeljem prijenosa  EU sredstava",67,null,null,{"$f":"IF(D78<>0,IF(E78/D78>=100,\">>100\",E78/D78*100),\"-\")","v":"-"}]
["6382","Kapitalne pomoći temeljem prijenosa  EU sredstava",68,null,null,"-"]
["639","Prijenosi između proračunskih korisnika istog proračuna (AOP 070 do 073)",69,{"$f":"SUM(D81:D84)","v":0},{"$f":"SUM(E81:E84)","v":0},"-"]
[6391,"Tekući prijenosi između proračunskih korisnika istog proračuna",70,null,null,"-"]
[6392,"Kapitalni prijenosi između proračunskih korisnika istog proračuna",71,null,null,"-"]
[6393,"Tekući prijenosi između proračunskih korisnika istog proračuna temeljem prijenosa EU sredstava",72,null,null,"-"]
[6394,"Kapitalni prijenosi između proračunskih korisnika istog proračuna temeljem prijenosa EU sredstava",73,null,null,"-"]
[64,"Prihodi od imovine (AOP 075+083+090+098)",74,{"$f":"D86+D94+D101+D109","v":226},{"$f":"E86+E94+E101+E109","v":86},38.053097345132741]
[641,"Prihodi od financijske imovine (AOP 076 do 082) ",75,{"$f":"SUM(D87:D93)","v":226},{"$f":"SUM(E87:E93)","v":86},38.053097345132741]
[6412,"Prihodi od kamata po vrijednosnim papirima",76,null,null,"-"]
[6413,"Kamate na oročena sredstva i depozite po viđenju",77,226,86,38.053097345132741]
[6414,"Prihodi od zateznih kamata ",78,null,null,"-"]
[6415,"Prihodi od pozitivnih tečajnih razlika i razlika zbog primjene valutne klauzule",79,null,null,"-"]
[6416,"Prihodi od dividendi",80,null,null,"-"]
[6417,"Prihodi iz dobiti trgovačkih društava, kreditnih i ostalih financijskih institucija po posebnim propisima",81,null,null,"-"]
[6419,"Ostali prihodi od financijske imovine",82,null,null,"-"]
[642,"Prihodi od nefinancijske imovine (AOP 084 do 089)",83,{"$f":"SUM(D95:D100)","v":0},{"$f":"SUM(E95:E100)","v":0},"-"]
[6421,"Naknade za koncesije",84,null,null,"-"]
[6422,"Prihodi od zakupa i iznajmljivanja imovine",85,null,null,"-"]
[6423,"Naknada za korištenje nefinancijske imovine",86,null,null,"-"]
[6424,"Naknade za ceste",87,null,null,"-"]
["6425","Prihodi od prodaje kratkotrajne nefinancijske imovine",88,null,null,"-"]
[6429,"Ostali prihodi od nefinancijske imovine",89,null,null,"-"]
[643,"Prihodi od kamata na dane zajmove (AOP 091 do 097)",90,{"$f":"SUM(D102:D108)","v":0},{"$f":"SUM(E102:E108)","v":0},"-"]
[6431,"Prihodi od kamata na dane zajmove međunarodnim organizacijama, institucijama i tijelima EU te inozemnim vladama",91,null,null,"-"]
[6432,"Prihodi od kamata na dane zajmove neprofitnim organizacijama, građanima i kućanstvima",92,null,null,"-"]
[6433,"Prihodi od kamata na dane zajmove kreditnim i ostalim financijskim institucijama u javnom sektoru",93,null,null,"-"]
[6434,"Prihodi od kamata na dane zajmove trgovačkim društvima u javnom sektoru",94,null,null,"-"]
[6435,"Prihodi od kamata na dane zajmove kreditnim i ostalim financijskim institucijama izvan javnog sektora",95,null,null,"-"]
[6436,"Prihodi od kamata na dane zajmove trgovačkim društvima i obrtnicima izvan javnog sektora",96,null,null,"-"]
[6437,"Prihodi od kamata na dane zajmove drugim razinama vlasti",97,null,null,"-"]
["644","Prihodi od kamata na dane zajmove po protestiranim jamstvima (AOP 099 do 104)",98,{"$f":"SUM(D110:D115)","v":0},{"$f":"SUM(E110:E115)","v":0},"-"]
["6442","Prihodi od kamata na dane zajmove neprofitnim organizacijama, građanima i kućanstvima po protestiranim jamstvima",99,null,null,"-"]
["6443","Prihodi od kamata na dane zajmove kreditnim i ostalim financijskim institucijama u javnom sektoru  po protestiranim jamstvima",100,null,null,"-"]
["6444","Prihodi od kamata na dane zajmove trgovačkim društvima u javnom sektoru po protestiranim jamstvima",101,null,null,"-"]
["6445","Prihodi od kamata na dane zajmove kreditnim i ostalim financijskim institucijama izvan javnog sektora po protestiranim jamstvima",102,null,null,"-"]
["6446","Prihodi od kamata na dane zajmove trgovačkim društvima i obrtnicima izvan javnog sektora po protestiranim jamstvima",103,null,null,"-"]
["6447","Prihodi od kamata na dane zajmove drugim razinama vlasti po protestiranim jamstvima",104,null,null,"-"]
[65,"Prihodi od upravnih i administrativnih pristojbi, pristojbi po posebnim propisima i naknada (AOP 106+111+119)",105,{"$f":"D117+D122+D130","v":484200},{"$f":"E117+E122+E130","v":490122},101.22304832713755]
[651,"Upravne i administrativne pristojbe (AOP 107 do 110)",106,{"$f":"SUM(D118:D121)","v":0},{"$f":"SUM(E118:E121)","v":0},"-"]
[6511,"Državne upravne i sudske pristojbe",107,null,null,"-"]
[6512,"Županijske, gradske i općinske pristojbe i naknade",108,null,null,"-"]
[6513,"Ostale upravne pristojbe i naknade",109,null,null,"-"]
[6514,"Ostale pristojbe i naknade",110,null,null,"-"]
[652,"Prihodi po posebnim propisima (AOP 112 do 118)",111,{"$f":"SUM(D123:D129)","v":484200},{"$f":"SUM(E123:E129)","v":490122},101.22304832713755]
[6521,"Prihodi državne uprave",112,null,null,"-"]
[6522,"Prihodi vodnog gospodarstva",113,null,null,"-"]
[6524,"Doprinosi za šume",114,null,null,"-"]
[6525,"Mjesni samodoprinos",115,null,null,"-"]
[6526,"Ostali nespomenuti prihodi",116,484200,490122,101.22304832713755]
[6527,"Naknade od financijske imovine",117,null,null,"-"]
["6528","Prihodi od novčane naknade poslodavca zbog nezapošljavanja osoba s invaliditetom",118,null,null,"-"]
[653,"Komunalni doprinosi i naknade (AOP 120 do 122)",119,{"$f":"SUM(D131:D133)","v":0},{"$f":"SUM(E131:E133)","v":0},"-"]
[6531,"Komunalni doprinosi",120,null,null,"-"]
[6532,"Komunalne naknade",121,null,null,"-"]
[6533,"Naknade za priključak",122,null,null,"-"]
[66,"Prihodi od prodaje proizvoda i robe te pruženih usluga i prihodi od donacija (AOP 124+127)",123,{"$f":"D135+D138","v":126805},{"$f":"E135+E138","v":166887},131.60916367651117]
[661,"Prihodi od prodaje proizvoda i robe te pruženih usluga (AOP 125+126)",124,{"$f":"SUM(D136:D137)","v":126805},{"$f":"SUM(E136:E137)","v":166887},131.60916367651117]
[6614,"Prihodi od prodaje proizvoda i robe",125,null,null,"-"]
[6615,"Prihodi od pruženih usluga",126,126805,166887,131.60916367651117]
[663,"Donacije od pravnih i fizičkih osoba izvan općeg proračuna (AOP 128+129)",127,{"$f":"SUM(D139:D140)","v":0},{"$f":"SUM(E139:E140)","v":0},"-"]
[6631,"Tekuće donacije",128,null,null,"-"]
[6632,"Kapitalne donacije",129,null,null,"-"]
[67,"Prihodi iz nadležnog proračuna i od HZZO-a na temelju ugovornih obveza (AOP 131+135)",130,{"$f":"D142+D146","v":860973},{"$f":"E142+E146","v":906869},105.33071304210469]
[671,"Prihodi iz nadležnog proračuna za financiranje redovne djelatnosti proračunskih korisnika (AOP 132 do 134)",131,{"$f":"SUM(D143:D145)","v":860973},{"$f":"SUM(E143:E145)","v":906869},{"$f":"IF(D142<>0,IF(E142/D142>=100,\">>100\",E142/D142*100),\"-\")","v":105.33071304210469}]
[6711,"Prihodi iz  nadležnog proračuna za financiranje rashoda poslovanja",132,860973,906869,105.33071304210469]
[6712,"Prihodi iz nadležnog proračuna za financiranje rashoda za nabavu nefinancijske imovine",133,null,null,"-"]
["6714","Prihodi od nadležnog proračuna za financiranje izdataka za financijsku imovinu i  otplatu zajmova",134,null,null,"-"]
["673","Prihodi od HZZO-a na temelju ugovornih obveza",135,null,null,"-"]
[68,"Kazne, upravne mjere i ostali prihodi (AOP 137+147)",136,{"$f":"D148+D158","v":0},{"$f":"E148+E158","v":0},"-"]
[681,"Kazne i upravne mjere (AOP 138 do 146)",137,{"$f":"SUM(D149:D157)","v":0},{"$f":"SUM(E149:E157)","v":0},"-"]
[6811,"Kazne za carinske prekršaje",138,null,null,"-"]
[6812,"Kazne za devizne prekršaje",139,null,null,"-"]
[6813,"Kazne za porezne prekršaje",140,null,null,"-"]
[6814,"Kazne za prekršaje trgovačkih društava - privredne prijestupe",141,null,null,"-"]
[6815,"Kazne za prometne i ostale prekršaje u nadležnosti MUP-a",142,null,null,"-"]
[6816,"Kazne i druge mjere u kaznenom postupku",143,null,null,"-"]
[6817,"Kazne za prekršaje na kulturnim dobrima",144,null,null,"-"]
[6818,"Upravne mjere",145,null,null,"-"]
[6819,"Ostale kazne",146,null,null,"-"]
[683,"Ostali prihodi",147,null,null,"-"]
[3,"RASHODI POSLOVANJA (AOP 149+160+193+212+221+246+257) ",148,{"$f":"D160+D171+D204+D223+D232+D257+D268","v":7344045},{"$f":"E160+E171+E204+E223+E232+E257+E268","v":7840643},106.76191390439465]
[31,"Rashodi za zaposlene (AOP 150+155+156)",149,{"$f":"D161+D166+D167","v":5955536},{"$f":"E161+E166+E167","v":6259741},105.10793654844836]
[311,"Plaće (bruto) (AOP 151 do 154) ",150,{"$f":"SUM(D162:D165)","v":4825040},{"$f":"SUM(E162:E165)","v":5043876},104.53542354053023]
[3111,"Plaće za redovan rad",151,4804533,5023864,104.56508468148726]
[3112,"Plaće u naravi",152,null,null,"-"]
[3113,"Plaće za prekovremeni rad",153,20507,20012,97.586190081435603]
[3114,"Plaće za posebne uvjete rada",154,null,null,"-"]
[312,"Ostali rashodi za zaposlene",155,306437,359985,117.47439114728313]
[313,"Doprinosi na plaće (AOP 157 do 159)",156,{"$f":"SUM(D168:D170)","v":824059},{"$f":"SUM(E168:E170)","v":855880},103.86149535409479]
[3131,"Doprinosi za mirovinsko osiguranje",157,null,null,"-"]
[3132,"Doprinosi za obvezno zdravstveno osiguranje",158,742612,771287,103.86137040608017]
[3133,"Doprinosi za obvezno osiguranje u slučaju nezaposlenosti",159,81447,84593,103.86263459673162]
[32,"Materijalni rashodi (AOP 161+166+174+184+185)",160,{"$f":"D172+D177+D185+D195+D196","v":1380197},{"$f":"E172+E177+E185+E195+E196","v":1543744},111.84954031924428]
[321,"Naknade troškova zaposlenima (AOP 162 do 165)",161,{"$f":"SUM(D173:D176)","v":132122},{"$f":"SUM(E173:E176)","v":151407},114.59635791162712]
[3211,"Službena putovanja",162,25216,38243,151.66164340101523]
[3212,"Naknade za prijevoz, za rad na terenu i odvojeni život",163,104276,107166,102.77149104300128]
[3213,"Stručno usavršavanje zaposlenika",164,1700,430,25.294117647058822]
[3214,"Ostale naknade troškova zaposlenima",165,930,5568,598.70967741935488]
[322,"Rashodi za materijal i energiju (AOP 167 do 173)",166,{"$f":"SUM(D178:D184)","v":1002953},{"$f":"SUM(E178:E184)","v":1122074},111.87702713885895]
[3221,"Uredski materijal i ostali materijalni rashodi",167,49700,49453,99.503018108651915]
[3222,"Materijal i sirovine",168,417950,460815,110.25601148462736]
[3223,"Energija",169,498015,533639,107.15319819684146]
[3224,"Materijal i dijelovi za tekuće i investicijsko održavanje",170,24137,74652,309.284500973609]
[3225,"Sitni inventar i auto gume",171,12851,3515,27.351957046144271]
[3226,"Vojna sredstva za jednokratnu upotrebu",172,null,null,"-"]
[3227,"Službena, radna i zaštitna odjeća i obuća",173,300,null,0]
[323,"Rashodi za usluge (AOP 175 do 183)",174,{"$f":"SUM(D186:D194)","v":220400},{"$f":"SUM(E186:E194)","v":218158},98.982758620689665]
[3231,"Usluge telefona, pošte i prijevoza",175,17936,17328,96.610169491525426]
[3232,"Usluge tekućeg i investicijskog održavanja",176,90018,75007,83.324446221866737]
[3233,"Usluge promidžbe i informiranja",177,2785,3520,126.39138240574506]
[3234,"Komunalne usluge",178,49383,48063,97.327015369661623]
[3235,"Zakupnine i najamnine",179,null,null,"-"]
[3236,"Zdravstvene i veterinarske usluge",180,13638,19414,142.35225106320576]
[3237,"Intelektualne i osobne usluge",181,20957,30883,147.36364937729638]
[3238,"Računalne usluge",182,6000,6562,109.36666666666666]
[3239,"Ostale usluge",183,19683,17381,88.304628359498039]
[324,"Naknade troškova osobama izvan radnog odnosa",184,null,null,"-"]
[329,"Ostali nespomenuti rashodi poslovanja (AOP 186 do 192)",185,{"$f":"SUM(D197:D203)","v":24722},{"$f":"SUM(E197:E203)","v":52105},210.76369225790791]
[3291,"Naknade za rad predstavničkih i izvršnih tijela, povjerenstava i slično",186,null,null,"-"]
[3292,"Premije osiguranja",187,null,null,"-"]
[3293,"Reprezentacija",188,4108,7670,186.70886075949366]
[3294,"Članarine i norme",189,null,1000,"-"]
[3295,"Pristojbe i naknade",190,9360,13759,146.99786324786325]
["3296","Troškovi sudskih postupaka",191,null,21908,"-"]
[3299,"Ostali nespomenuti rashodi poslovanja ",192,11254,7768,69.024346898880395]
[34,"Financijski rashodi (AOP 194+199+207) ",193,{"$f":"D205+D210+D218","v":8312},{"$f":"E205+E210+E218","v":37158},447.0404234841194]
[341,"Kamate za izdane vrijednosne papire (AOP 195 do 198)",194,{"$f":"SUM(D206:D209)","v":0},{"$f":"SUM(E206:E209)","v":0},"-"]
[3411,"Kamate za izdane trezorske zapise",195,null,null,{"$f":"IF(D206<>0,IF(E206/D206>=100,\">>100\",E206/D206*100),\"-\")","v":"-"}]
[3412,"Kamate za izdane mjenice",196,null,null,"-"]
[3413,"Kamate za izdane obveznice",197,null,null,"-"]
[3419,"Kamate za ostale vrijednosne papire",198,null,null,"-"]
[342,"Kamate za primljene kredite i zajmove (AOP 200 do 206)",199,{"$f":"SUM(D211:D217)","v":0},{"$f":"SUM(E211:E217)","v":0},"-"]
[3421,"Kamate za primljene kredite i zajmove od međunarodnih organizacija, institucija i tijela EU te inozemnih vlada",200,null,null,"-"]
[3422,"Kamate za primljene kredite i zajmove od kreditnih i ostalih financijskih institucija u javnom sektoru",201,null,null,"-"]
[3423,"Kamate za primljene kredite i zajmove od kreditnih i ostalih financijskih institucija izvan javnog sektora",202,null,null,"-"]
[3425,"Kamate za odobrene, a nerealizirane kredite i zajmove",203,null,null,"-"]
[3426,"Kamate za primljene zajmove od trgovačkih društava u javnom sektoru",204,null,null,"-"]
[3427,"Kamate za primljene zajmove od trgovačkih društava i obrtnika izvan javnog sektora",205,null,null,"-"]
[3428,"Kamate za primljene zajmove od drugih razina vlasti",206,null,null,"-"]
[343,"Ostali financijski rashodi (AOP 208 do 211)",207,{"$f":"SUM(D219:D222)","v":8312},{"$f":"SUM(E219:E222)","v":37158},447.0404234841194]
[3431,"Bankarske usluge i usluge platnog prometa",208,8312,10483,126.11886429258902]
[3432,"Negativne tečajne razlike i razlike zbog primjene valutne klauzule",209,null,null,"-"]
[3433,"Zatezne kamate ",210,null,26675,"-"]
[3434,"Ostali nespomenuti financijski rashodi",211,null,null,"-"]
[35,"Subvencije (AOP 213+216+220)",212,{"$f":"D224+D227+D231","v":0},{"$f":"E224+E227+E231","v":0},"-"]
[351,"Subvencije trgovačkim društvima u javnom sektoru (AOP 214+215)",213,{"$f":"SUM(D225:D226)","v":0},{"$f":"SUM(E225:E226)","v":0},"-"]
[3511,"Subvencije kreditnim i ostalim financijskim institucijama u javnom sektoru",214,null,null,"-"]
[3512,"Subvencije trgovačkim društvima u javnom sektoru",215,null,null,"-"]
[352,"Subvencije trgovačkim društvima, zadrugama, poljoprivrednicima i obrtnicima izvan javnog sektora (AOP 217 do 219)",216,{"$f":"SUM(D228:D230)","v":0},{"$f":"SUM(E228:E230)","v":0},"-"]
[3521,"Subvencije kreditnim i ostalim financijskim institucijama izvan javnog sektora",217,null,null,"-"]
[3522,"Subvencije trgovačkim društvima i zadrugama izvan javnog sektora",218,null,null,"-"]
[3523,"Subvencije poljoprivrednicima i obrtnicima",219,null,null,"-"]
["353","Subvencije trgovačkim društvima, zadrugama, poljoprivrednicima i obrtnicima iz EU sredstava ",220]
[36,"Pomoći dane u inozemstvo i unutar općeg proračuna (AOP 222+225+228+231+234+238+241)",221,{"$f":"D233+D236+D239+D242+D245+D249+D252","v":0},{"$f":"E233+E236+E239+E242+E245+E249+E252","v":0},"-"]
[361,"Pomoći inozemnim vladama (AOP 223+224)",222,{"$f":"SUM(D234:D235)","v":0},{"$f":"SUM(E234:E235)","v":0},"-"]
[3611,"Tekuće pomoći inozemnim vladama",223,null,null,"-"]
[3612,"Kapitalne pomoći inozemnim vladama",224,null,null,"-"]
[362,"Pomoći međunarodnim organizacijama te institucijama i tijelima EU (AOP 226+227)",225,{"$f":"SUM(D237:D238)","v":0},{"$f":"SUM(E237:E238)","v":0},"-"]
[3621,"Tekuće pomoći međunarodnim organizacijama te institucijama i tijelima EU",226,null,null,"-"]
[3622,"Kapitalne pomoći međunarodnim organizacijama te institucijama i tijelima EU",227,null,null,"-"]
[363,"Pomoći unutar općeg proračuna (AOP 229+230)",228,{"$f":"SUM(D240:D241)","v":0},{"$f":"SUM(E240:E241)","v":0},"-"]
[3631,"Tekuće pomoći unutar općeg proračuna",229,null,null,"-"]
[3632,"Kapitalne pomoći unutar općeg proračuna ",230,null,null,"-"]
["366","Pomoći proračunskim korisnicima drugih proračuna (AOP232+233)",231,{"$f":"SUM(D243:D244)","v":0},{"$f":"SUM(E243:E244)","v":0},"-"]
["3661","Tekuće pomoći proračunskim korisnicima drugih proračuna",232,null,null,"-"]
["3662","Kapitalne pomoći proračunskim korisnicima drugih proračuna",233,null,null,"-"]
["367","Prijenosi proračunskim korisnicima iz nadležnog proračuna za financiranje redovne djelatnosti (AOP 235 do 237)",234,{"$f":"SUM(D246:D248)","v":0},{"$f":"SUM(E246:E248)","v":0},"-"]
[3672,"Prijenosi proračunskim korisnicima iz nadležnog proračuna za financiranje rashoda poslovanja",235,null,null,"-"]
[3673,"Prijenosi proračunskim korisnicima iz nadležnog proračuna za nabavu nefinancijske imovine",236]
[3674,"Prijenosi proračunskim korisnicima iz nadležnog proračuna za financijsku imovinu i otplatu zajmova",237]
["368","Pomoći temeljem prijenosa EU sredstava (AOP239+240)",238,{"$f":"SUM(D250:D251)","v":0},{"$f":"SUM(E250:E251)","v":0},"-"]
["3681","Tekuće pomoći temeljem prijenosa EU sredstava",239,null,null,"-"]
["3682","Kapitalne pomoći temeljem prijenosa EU sredstava",240,null,null,"-"]
["369","Prijenosi između proračunskih korisnika istog proračuna (AOP 242 do 245)",241,{"$f":"SUM(D253:D256)","v":0},{"$f":"SUM(E253:E256)","v":0}]
["3691","Tekući prijenosi između proračunskih korisnika istog proračuna",242]
["3692","Kapitalni prijenosi između proračunskih korisnika istog proračuna",243]
["3693","Tekući prijenosi između proračunskih korisnika istog proračuna temeljem prijenosa EU sredstava",244]
["3694","Kapitalni prijenosi između proračunskih korisnika istog proračuna temeljem prijenosa EU sredstava",245]
[37,"Naknade građanima i kućanstvima na temelju osiguranja i druge naknade (AOP 247+253)",246,{"$f":"D258+D264","v":0},{"$f":"E258+E264","v":0},"-"]
[371,"Naknade građanima i kućanstvima na temelju osiguranja (AOP 248 do 252)",247,{"$f":"SUM(D259:D263)","v":0},{"$f":"SUM(E259:E263)","v":0},"-"]
[3711,"Naknade građanima i kućanstvima u novcu - neposredno ili putem ustanova izvan javnog sektora",248,null,null,"-"]
[3712,"Naknade građanima i kućanstvima u naravi - neposredno ili putem ustanova izvan javnog sektora",249,null,null,"-"]
["3713","Naknade građanima i kućanstvima u novcu - putem ustanova u javnom sektoru",250,null,null,"-"]
["3714","Naknade građanima i kućanstvima u naravi - putem ustanova u javnom sektoru",251,null,null,"-"]
["3715","Naknade građanima i kućanstvima na temelju osiguranja iz EU sredstava",252]
[372,"Ostale naknade građanima i kućanstvima iz proračuna (AOP 254 do 256) ",253,{"$f":"SUM(D265:D267)","v":0},{"$f":"SUM(E265:E267)","v":0},"-"]
[3721,"Naknade građanima i kućanstvima u novcu ",254,null,null,"-"]
[3722,"Naknade građanima i kućanstvima u naravi",255,null,null,"-"]
["3723","Naknade građanima i kućanstvima iz EU sredstava",256]
[38,"Ostali rashodi (AOP 258+262+266+272)",257,{"$f":"D269+D273+D277+D283","v":0},{"$f":"E269+E273+E277+E283","v":0},"-"]
[381,"Tekuće donacije (AOP 259 do 261) ",258,{"$f":"SUM(D270:D272)","v":0},{"$f":"SUM(E270:E272)","v":0},"-"]
[3811,"Tekuće donacije u novcu",259,null,null,{"$f":"IF(D270<>0,IF(E270/D270>=100,\">>100\",E270/D270*100),\"-\")","v":"-"}]
[3812,"Tekuće donacije u naravi",260,null,null,"-"]
["3813","Tekuće donacije iz EU sredstava",261]
[382,"Kapitalne donacije (AOP 263 do 265) ",262,{"$f":"SUM(D274:D276)","v":0},{"$f":"SUM(E274:E276)","v":0},"-"]
[3821,"Kapitalne donacije neprofitnim organizacijama",263,null,null,"-"]
[3822,"Kapitalne donacije građanima i kućanstvima",264,null,null,"-"]
["3823","Kapitalne donacije iz EU sredstava",265]
[383,"Kazne, penali i naknade štete (AOP 267 do 271)",266,{"$f":"SUM(D278:D282)","v":0},{"$f":"SUM(E278:E282)","v":0},"-"]
[3831,"Naknade šteta pravnim i fizičkim osobama",267,null,null,"-"]
[3832,"Penali, ležarine i drugo",268,null,null,"-"]
[3833,"Naknade šteta zaposlenicima ",269,null,null,"-"]
[3834,"Ugovorene kazne i ostale naknade šteta",270,null,null,"-"]
["3835","Ostale kazne",271,null,null,"-"]
[386,"Kapitalne pomoći (AOP 273 do 276)",272,{"$f":"SUM(D284:D287)","v":0},{"$f":"SUM(E284:E287)","v":0},"-"]
[3861,"Kapitalne pomoći kreditnim i ostalim financijskim institucijama te trgovačkim društvima u javnom sektoru",273,null,null,"-"]
[3862,"Kapitalne pomoći kreditnim i ostalim financijskim institucijama te trgovačkim društvima izvan javnog sektora",274,null,null,"-"]
[3863,"Kapitalne pomoći poljoprivrednicima i obrtnicima",275,null,null,"-"]
["3864","Kapitalne pomoći iz EU sredstava ",276]
[" ","Stanje zaliha proizvodnje i gotovih proizvoda na početku razdoblja",277,null,null,"-"]
[" ","Stanje zaliha proizvodnje i gotovih proizvoda na kraju razdoblja ",278,null,null,"-"]
[" ","Povećanje zaliha proizvodnje i gotovih proizvoda (AOP 278-277)",279,{"$f":"IF(D289>=D288,D289-D288,0)","v":0},{"$f":"IF(E289>=E288,E289-E288,0)","v":0},"-"]
[" ","Smanjenje zaliha proizvodnje i gotovih proizvoda (AOP 277-278) ",280,{"$f":"IF(D288>=D289,D288-D289,0)","v":0},{"$f":"IF(E288>=E289,E288-E289,0)","v":0},"-"]
[" ","Ukupni rashodi poslovanja (AOP 148-279+280)",281,{"$f":"D159-D290+D291","v":7344045},{"$f":"E159-E290+E291","v":7840643},106.76191390439465]
[" ","VIŠAK PRIHODA POSLOVANJA (AOP 001-281) ",282,{"$f":"IF(D12>=D292,D12-D292,0)","v":33540},{"$f":"IF(E12>=E292,E12-E292,0)","v":0},0]
[" ","MANJAK PRIHODA POSLOVANJA (AOP 281-001)",283,{"$f":"IF(D292>=D12,D292-D12,0)","v":0},{"$f":"IF(E292>=E12,E292-E12,0)","v":19429},"-"]
[92211,"Višak prihoda poslovanja - preneseni",284,66867,85944,128.52976804701871]
[92221,"Manjak prihoda poslovanja - preneseni",285,null,null,"-"]
[96,"Obračunati prihodi poslovanja - nenaplaćeni",286,7258,8943,123.2157619178837]
[9661,"Obračunati prihodi od prodaje proizvoda i robe i pruženih usluga - nenaplaćeni",287,7258,8943,123.2157619178837]
["9673","Obračunati prihodi od HZZO-a na temelju ugovornih obveza",288,null,null,"-"]
["Prihodi i rashodi od nefinancijske imovine"]
[7,"Prihodi od prodaje nefinancijske imovine (AOP 290+302+335+339)",289,{"$f":"D302+D314+D347+D351","v":0},{"$f":"E302+E314+E347+E351","v":0},{"$f":"IF(D301<>0,IF(E301/D301>=100,\">>100\",E301/D301*100),\"-\")","v":"-"}]
[71,"Prihodi od prodaje neproizvedene dugotrajne imovine (AOP 291+295)",290,{"$f":"D303+D307","v":0},{"$f":"E303+E307","v":0},"-"]
[711,"Prihodi od prodaje materijalne imovine - prirodnih bogatstava (AOP 292 do 294)",291,{"$f":"SUM(D304:D306)","v":0},{"$f":"SUM(E304:E306)","v":0},"-"]
[7111,"Zemljište",292,null,null,"-"]
[7112,"Rudna bogatstva",293,null,null,"-"]
[7113,"Prihodi od prodaje ostale prirodne materijalne imovine",294,null,null,"-"]
[712,"Prihodi od prodaje nematerijalne imovine (AOP 296 do 301)",295,{"$f":"SUM(D308:D313)","v":0},{"$f":"SUM(E308:E313)","v":0},"-"]
[7121,"Patenti",296,null,null,"-"]
[7122,"Koncesije",297,null,null,"-"]
[7123,"Licence",298,null,null,"-"]
[7124,"Ostala prava",299,null,null,"-"]
[7125,"Goodwill",300,null,null,"-"]
[7126,"Ostala nematerijalna imovina",301,null,null,"-"]
[72,"Prihodi od prodaje proizvedene dugotrajne imovine (AOP 303+308+317+322+327+330)",302,{"$f":"D315+D320+D329+D334+D339+D342","v":0},{"$f":"E315+E320+E329+E334+E339+E342","v":0},"-"]
[721,"Prihodi od prodaje građevinskih objekata (AOP 304 do 307)",303,{"$f":"SUM(D316:D319)","v":0},{"$f":"SUM(E316:E319)","v":0},"-"]
[7211,"Stambeni objekti",304,null,null,"-"]
[7212,"Poslovni objekti",305,null,null,"-"]
[7213,"Ceste, željeznice i ostali prometni objekti",306,null,null,"-"]
[7214,"Ostali građevinski objekti",307,null,null,"-"]
[722,"Prihodi od prodaje postrojenja i opreme (AOP 309 do 316)",308,{"$f":"SUM(D321:D328)","v":0},{"$f":"SUM(E321:E328)","v":0},"-"]
[7221,"Uredska oprema i namještaj",309,null,null,"-"]
[7222,"Komunikacijska oprema ",310,null,null,"-"]
[7223,"Oprema za održavanje i zaštitu",311,null,null,"-"]
[7224,"Medicinska i laboratorijska oprema",312,null,null,"-"]
[7225,"Instrumenti, uređaji i strojevi ",313,null,null,"-"]
[7226,"Sportska i glazbena oprema",314,null,null,"-"]
[7227,"Uređaji, strojevi i oprema za ostale namjene",315,null,null,"-"]
["7228","Vojna oprema",316,null,null,"-"]
[723,"Prihodi od prodaje prijevoznih sredstava (AOP 318 do 321)",317,{"$f":"SUM(D330:D333)","v":0},{"$f":"SUM(E330:E333)","v":0},"-"]
[7231,"Prijevozna sredstva u cestovnom prometu",318,null,null,"-"]
[7232,"Prijevozna sredstva u željezničkom prometu",319,null,null,"-"]
[7233,"Prijevozna sredstva u pomorskom i riječnom prometu",320,null,null,"-"]
[7234,"Prijevozna sredstva u zračnom prometu",321,null,null,"-"]
[724,"Prihodi od prodaje knjiga, umjetničkih djela i ostalih izložbenih vrijednosti (AOP 323 do 326)",322,{"$f":"SUM(D335:D338)","v":0},{"$f":"SUM(E335:E338)","v":0},"-"]
[7241,"Knjige",323,null,null,"-"]
[7242,"Umjetnička djela (izložena u galerijama, muzejima i slično)",324,null,null,"-"]
[7243,"Muzejski izlošci i predmeti prirodnih rijetkosti",325,null,null,"-"]
[7244,"Ostale nespomenute izložbene vrijednosti",326,null,null,"-"]
[725,"Prihodi od prodaje višegodišnjih nasada i osnovnog stada (AOP 328+329)",327,{"$f":"SUM(D340:D341)","v":0},{"$f":"SUM(E340:E341)","v":0},"-"]
[7251,"Višegodišnji nasadi",328,null,null,"-"]
[7252,"Osnovno stado",329,null,null,"-"]
[726,"Prihodi od prodaje nematerijalne proizvedene imovine (AOP 331 do 334)",330,{"$f":"SUM(D343:D346)","v":0},{"$f":"SUM(E343:E346)","v":0},"-"]
[7261,"Istraživanje rudnih bogatstava",331,null,null,"-"]
[7262,"Ulaganja u računalne programe ",332,null,null,"-"]
[7263,"Umjetnička, literarna i znanstvena djela",333,null,null,"-"]
[7264,"Ostala nematerijalna proizvedena imovina",334,null,null,"-"]
[73,"Prihodi od prodaje plemenitih metala i ostalih pohranjenih vrijednosti (AOP 336)",335,{"$f":"D348","v":0},{"$f":"E348","v":0},"-"]
[731,"Prihodi od prodaje plemenitih metala i ostalih pohranjenih vrijednosti (AOP 337+338)",336,{"$f":"SUM(D349:D350)","v":0},{"$f":"SUM(E349:E350)","v":0},"-"]
[7311,"Plemeniti metali i drago kamenje",337,null,null,"-"]
[7312,"Pohranjene knjige, umjetnička djela i slične vrijednosti",338,null,null,"-"]
[74,"Prihodi od prodaje proizvedene kratkotrajne imovine (AOP 340)",339,{"$f":"D352","v":0},{"$f":"E352","v":0},"-"]
[741,"Prihodi od prodaje zaliha",340,null,null,"-"]
[4,"Rashodi za nabavu nefinancijske imovine (AOP 342+354+387+391+393)",341,{"$f":"D354+D366+D399+D403+D405","v":14462},{"$f":"E354+E366+E399+E403+E405","v":53965},373.15032498962802]
[41,"Rashodi za nabavu neproizvedene dugotrajne imovine (AOP 343+347)",342,{"$f":"D355+D359","v":0},{"$f":"E355+E359","v":0},"-"]
[411,"Materijalna imovina - prirodna bogatstva (AOP 344 do 346)",343,{"$f":"SUM(D356:D358)","v":0},{"$f":"SUM(E356:E358)","v":0},"-"]
[4111,"Zemljište",344,null,null,"-"]
[4112,"Rudna bogatstva",345,null,null,"-"]
[4113,"Ostala prirodna materijalna imovina",346,null,null,"-"]
[412,"Nematerijalna imovina (AOP 348 do 353)",347,{"$f":"SUM(D360:D365)","v":0},{"$f":"SUM(E360:E365)","v":0},"-"]
[4121,"Patenti",348,null,null,"-"]
[4122,"Koncesije",349,null,null,"-"]
[4123,"Licence",350,null,null,"-"]
[4124,"Ostala prava",351,null,null,"-"]
[4125,"Goodwill",352,null,null,"-"]
[4126,"Ostala nematerijalna imovina",353,null,null,{"$f":"IF(D365<>0,IF(E365/D365>=100,\">>100\",E365/D365*100),\"-\")","v":"-"}]
[42,"Rashodi za nabavu proizvedene dugotrajne imovine (AOP 355+360+369+374+379+382)",354,{"$f":"D367+D372+D381+D386+D391+D394","v":14462},{"$f":"E367+E372+E381+E386+E391+E394","v":53965},373.15032498962802]
[421,"Građevinski objekti (AOP 356 do 359)",355,{"$f":"SUM(D368:D371)","v":0},{"$f":"SUM(E368:E371)","v":0},"-"]
[4211,"Stambeni objekti",356,null,null,"-"]
[4212,"Poslovni objekti",357,null,null,"-"]
[4213,"Ceste, željeznice i ostali prometni objekti",358,null,null,"-"]
[4214,"Ostali građevinski objekti",359,null,null,"-"]
[422,"Postrojenja i oprema (AOP 361 do 368)",360,{"$f":"SUM(D373:D380)","v":14142},{"$f":"SUM(E373:E380)","v":53965},381.5938339697355]
[4221,"Uredska oprema i namještaj",361,8692,27375,314.94477680625863]
[4222,"Komunikacijska oprema",362,null,null,"-"]
[4223,"Oprema za održavanje i zaštitu",363,null,16464,"-"]
[4224,"Medicinska i laboratorijska oprema",364,null,null,"-"]
[4225,"Instrumenti, uređaji i strojevi ",365,null,null,"-"]
[4226,"Sportska i glazbena oprema",366,null,3390,"-"]
[4227,"Uređaji, strojevi i oprema za ostale namjene",367,5450,6736,123.59633027522936]
["4228","Vojna oprema",368,null,null,"-"]
[423,"Prijevozna sredstva (AOP 370 do 373)",369,{"$f":"SUM(D382:D385)","v":0},{"$f":"SUM(E382:E385)","v":0},"-"]
[4231,"Prijevozna sredstva u cestovnom prometu",370,null,null,"-"]
[4232,"Prijevozna sredstva u željezničkom prometu",371,null,null,"-"]
[4233,"Prijevozna sredstva u pomorskom i riječnom prometu",372,null,null,"-"]
[4234,"Prijevozna sredstva u zračnom prometu",373,null,null,"-"]
[424,"Knjige, umjetnička djela i ostale izložbene vrijednosti (AOP 375 do 378)",374,{"$f":"SUM(D387:D390)","v":320},{"$f":"SUM(E387:E390)","v":0},0]
[4241,"Knjige ",375,320,null,0]
[4242,"Umjetnička djela (izložena u galerijama, muzejima i slično)",376,null,null,"-"]
[4243,"Muzejski izlošci i predmeti prirodnih rijetkosti",377,null,null,"-"]
[4244,"Ostale nespomenute izložbene vrijednosti",378,null,null,"-"]
[425,"Višegodišnji nasadi i osnovno stado (AOP 380+381)",379,{"$f":"SUM(D392:D393)","v":0},{"$f":"SUM(E392:E393)","v":0},"-"]
[4251,"Višegodišnji nasadi ",380,null,null,"-"]
[4252,"Osnovno stado",381,null,null,"-"]
[426,"Nematerijalna proizvedena imovina (AOP 383 do 386)",382,{"$f":"SUM(D395:D398)","v":0},{"$f":"SUM(E395:E398)","v":0},"-"]
[4261,"Istraživanje rudnih bogatstava",383,null,null,"-"]
[4262,"Ulaganja u računalne programe ",384,null,null,"-"]
[4263,"Umjetnička, literarna i znanstvena djela",385,null,null,"-"]
[4264,"Ostala nematerijalna proizvedena imovina",386,null,null,"-"]
[43,"Rashodi za nabavu plemenitih metala i ostalih pohranjenih vrijednosti (AOP 388)",387,{"$f":"D400","v":0},{"$f":"E400","v":0},"-"]
[431,"Plemeniti metali i ostale pohranjene vrijednosti (AOP 389+390)",388,{"$f":"SUM(D401:D402)","v":0},{"$f":"SUM(E401:E402)","v":0},"-"]
[4311,"Plemeniti metali i drago kamenje",389,null,null,"-"]
[4312,"Pohranjene knjige, umjetnička djela i slične vrijednosti",390,null,null,"-"]
[44,"Rashodi za nabavu proizvedene kratkotrajne imovine (AOP 392)",391,{"$f":"D404","v":0},{"$f":"E404","v":0},"-"]
[441,"Rashodi za nabavu zaliha",392,null,null,"-"]
[45,"Rashodi za dodatna ulaganja na nefinancijskoj imovini (AOP 394 do 397)",393,{"$f":"SUM(D406:D409)","v":0},{"$f":"SUM(E406:E409)","v":0},"-"]
[451,"Dodatna ulaganja na građevinskim objektima",394,null,null,"-"]
[452,"Dodatna ulaganja na postrojenjima i opremi",395,null,null,"-"]
[453,"Dodatna ulaganja na prijevoznim sredstvima",396,null,null,"-"]
[454,"Dodatna ulaganja za ostalu nefinancijsku imovinu",397,null,null,"-"]
[" ","VIŠAK PRIHODA OD NEFINANCIJSKE IMOVINE (AOP 289-341)",398,{"$f":"IF(D301>=D353, D301-D353, 0)","v":0},{"$f":"IF(E301>=E353, E301-E353, 0)","v":0},"-"]
[" ","MANJAK PRIHODA OD NEFINANCIJSKE IMOVINE (AOP 341-289)",399,{"$f":"IF(D353>=D301, D353-D301, 0)","v":14462},{"$f":"IF(E353>=E301, E353-E301, 0)","v":53965},373.15032498962802]
[92212,"Višak prihoda od nefinancijske imovine - preneseni ",400,null,null,"-"]
[92222,"Manjak prihoda od nefinancijske imovine - preneseni ",401,null,null,"-"]
[97,"Obračunati prihodi od prodaje nefinancijske imovine - nenaplaćeni",402,null,null,"-"]
[" ","UKUPNI PRIHODI (AOP 001+289)",403,{"$f":"D12+D301","v":7377585},{"$f":"E12+E301","v":7821214},106.01320079673768]
[" ","UKUPNI RASHODI (AOP 281+341)",404,{"$f":"D292+D353","v":7358507},{"$f":"E292+E353","v":7894608},107.28545885734701]
[" ","UKUPAN VIŠAK PRIHODA (AOP 403-404)",405,{"$f":"IF(D415>=D416,D415-D416,0)","v":19078},{"$f":"IF(E415>=E416,E415-E416,0)","v":0},0]
[" ","UKUPAN MANJAK PRIHODA (AOP 404-403)",406,{"$f":"IF(D416>=D415,D416-D415,0)","v":0},{"$f":"IF(E416>=E415,E416-E415,0)","v":73394},"-"]
["9221x, 9222x","Višak prihoda - preneseni (AOP 284+400-285-401)",407,{"$f":"IF(D295-D296+D412-D413>=0,D295-D296+D412-D413,0)","v":66867},{"$f":"IF(E295-E296+E412-E413>=0,E295-E296+E412-E413,0)","v":85944},128.52976804701871]
["9221x, 9222x","Manjak prihoda - preneseni (AOP 285+401-284-400)",408,{"$f":"IF(D296-D295+D413-D412>=0,D296-D295+D413-D412,0)","v":0},{"$f":"IF(E296-E295+E413-E412>=0,E296-E295+E413-E412,0)","v":0},"-"]
["96, 97","Obračunati prihodi - nenaplaćeni (AOP 286+402)",409,{"$f":"D297+D414","v":7258},{"$f":"E297+E414","v":8943},123.2157619178837]
["Primici i izdaci"]
[8,"Primici od financijske imovine i zaduživanja (AOP 411+449+462+474+505)",410,{"$f":"D424+D462+D475+D487+D518","v":0},{"$f":"E424+E462+E475+E487+E518","v":0},{"$f":"IF(D423<>0,IF(E423/D423>=100,\">>100\",E423/D423*100),\"-\")","v":"-"}]
[81,"Primljeni povrati glavnice danih zajmova i depozita (AOP 412+417+420+424+425+432+437+445)",411,{"$f":"D425+D430+D433+D437+D438+D445+D450+D458","v":0},{"$f":"E425+E430+E433+E437+E438+E445+E450+E458","v":0},"-"]
[811,"Primici (povrati) glavnice zajmova danih međunarodnim organizacijama, institucijama i tijelima EU te inozemnim vladama (AOP 413 do 416)",412,{"$f":"SUM(D426:D429)","v":0},{"$f":"SUM(E426:E429)","v":0},"-"]
[8113,"Povrat zajmova danih međunarodnim organizacijama",413,null,null,"-"]
[8114,"Povrat zajmova danih institucijama i tijelima EU",414,null,null,"-"]
[8115,"Povrat zajmova danih inozemnim vladama u EU",415,null,null,"-"]
[8116,"Povrat zajmova danih inozemnim vladama izvan EU",416,null,null,"-"]
[812,"Primici (povrati) glavnice zajmova danih neprofitnim organizacijama, građanima i kućanstvima (AOP 418+419)",417,{"$f":"SUM(D431:D432)","v":0},{"$f":"SUM(E431:E432)","v":0},"-"]
[8121,"Povrat zajmova danih neprofitnim organizacijama, građanima i kućanstvima u tuzemstvu",418,null,null,"-"]
[8122,"Povrat zajmova danih neprofitnim organizacijama, građanima i kućanstvima u inozemstvu",419,null,null,"-"]
[813,"Primici (povrati) glavnice zajmova danih kreditnim i ostalim financijskim institucijama u javnom sektoru (AOP 421 do 423)",420,{"$f":"SUM(D434:D436)","v":0},{"$f":"SUM(E434:E436)","v":0},"-"]
[8132,"Povrat zajmova danih kreditnim institucijama u javnom sektoru",421,null,null,"-"]
[8133,"Povrat zajmova danih osiguravajućim društvima u javnom sektoru",422,null,null,"-"]
[8134,"Povrat zajmova danih ostalim financijskim institucijama u javnom sektoru",423,null,null,"-"]
[814,"Primici (povrati) glavnice zajmova danih trgovačkim društvima u javnom sektoru",424,null,null,"-"]
[815,"Primici (povrati) glavnice zajmova danih kreditnim i ostalim financijskim institucijama izvan javnog sektora (AOP 426 do 431)",425,{"$f":"SUM(D439:D444)","v":0},{"$f":"SUM(E439:E444)","v":0},"-"]
[8153,"Povrat zajmova danih tuzemnim kreditnim institucijama izvan javnog sektora",426,null,null,"-"]
[8154,"Povrat zajmova danih tuzemnim osiguravajućim društvima izvan javnog sektora",427,null,null,"-"]
[8155,"Povrat zajmova danih ostalim tuzemnim financijskim institucijama izvan javnog sektora",428,null,null,"-"]
[8156,"Povrat zajmova danih inozemnim kreditnim institucijama",429,null,null,"-"]
[8157,"Povrat zajmova danih inozemnim osiguravajućim društvima",430,null,null,"-"]
[8158,"Povrat zajmova danih ostalim inozemnim financijskim institucijama",431,null,null,"-"]
[816,"Primici (povrati) glavnice zajmova danih trgovačkim društvima i obrtnicima izvan javnog sektora (AOP 433 do 436)",432,{"$f":"SUM(D446:D449)","v":0},{"$f":"SUM(E446:E449)","v":0},"-"]
[8163,"Povrat zajmova danih tuzemnim trgovačkim društvima izvan javnog sektora",433,null,null,"-"]
[8164,"Povrat zajmova danih tuzemnim obrtnicima",434,null,null,"-"]
[8165,"Povrat zajmova danih inozemnim trgovačkim društvima",435,null,null,"-"]
[8166,"Povrat zajmova danih inozemnim obrtnicima",436,null,null,"-"]
[817,"Povrat zajmova danih drugim razinama vlasti (AOP 438 do 444)",437,{"$f":"SUM(D451:D457)","v":0},{"$f":"SUM(E451:E457)","v":0},"-"]
[8171,"Povrat zajmova danih državnom proračunu",438,null,null,"-"]
[8172,"Povrat zajmova danih županijskim proračunima",439,null,null,"-"]
[8173,"Povrat zajmova danih gradskim proračunima",440,null,null,"-"]
[8174,"Povrat zajmova danih općinskim proračunima",441,null,null,"-"]
[8175,"Povrat zajmova danih HZMO-u, HZZ-u i HZZO-u",442,null,null,"-"]
[8176,"Povrat zajmova danih ostalim izvanproračunskim korisnicima državnog proračuna",443,null,null,"-"]
[8177,"Povrat zajmova danih izvanproračunskim korisnicima županijskih, gradskih i općinskih proračuna",444,null,null,"-"]
["818","Primici od povrata depozita i jamčevnih pologa (AOP 446 do 448)",445,{"$f":"SUM(D459:D461)","v":0},{"$f":"SUM(E459:E461)","v":0},"-"]
["8181","Primici od povrata depozita od kreditnih i ostalih financijskih institucija - tuzemni",446,null,null,"-"]
["8182","Primici od povrata depozita od kreditnih i ostalih financijskih institucija - inozemni",447,null,null,"-"]
["8183","Primici od povrata jamčevnih pologa",448,null,null,"-"]
[82,"Primici od izdanih vrijednosnih papira (AOP 450+453+456+459)",449,{"$f":"D463+D466+D469+D472","v":0},{"$f":"E463+E466+E469+E472","v":0},"-"]
[821,"Trezorski zapisi (AOP 451+452)",450,{"$f":"SUM(D464:D465)","v":0},{"$f":"SUM(E464:E465)","v":0},"-"]
[8211,"Trezorski zapisi - tuzemni",451,null,null,"-"]
[8212,"Trezorski zapisi - inozemni",452,null,null,"-"]
[822,"Obveznice (AOP 454+455)",453,{"$f":"SUM(D467:D468)","v":0},{"$f":"SUM(E467:E468)","v":0},"-"]
[8221,"Obveznice - tuzemne",454,null,null,"-"]
[8222,"Obveznice - inozemne",455,null,null,"-"]
[823,"Opcije i drugi financijski derivati (AOP 457+458)",456,{"$f":"SUM(D470:D471)","v":0},{"$f":"SUM(E470:E471)","v":0},"-"]
[8231,"Opcije i drugi financijski derivati - tuzemni",457,null,null,"-"]
[8232,"Opcije i drugi financijski derivati - inozemni",458,null,null,"-"]
[824,"Ostali vrijednosni papiri (AOP 460+461)",459,{"$f":"SUM(D473:D474)","v":0},{"$f":"SUM(E473:E474)","v":0},"-"]
[8241,"Ostali vrijednosni papiri - tuzemni",460,null,null,"-"]
[8242,"Ostali vrijednosni papiri - inozemni",461,null,null,"-"]
[83,"Primici od prodaje dionica i udjela u glavnici (AOP 463+467+468+471)",462,{"$f":"D476+D480+D481+D484","v":0},{"$f":"E476+E480+E481+E484","v":0},"-"]
[831,"Primici od prodaje dionica i udjela u glavnici kreditnih i ostalih financijskih institucija u javnom sektoru (AOP 464 do 466)",463,{"$f":"SUM(D477:D479)","v":0},{"$f":"SUM(E477:E479)","v":0},"-"]
[8312,"Dionice i udjeli u glavnici kreditnih institucija u javnom sektoru",464,null,null,"-"]
[8313,"Dionice i udjeli u glavnici osiguravajućih društava u javnom sektoru",465,null,null,"-"]
[8314,"Dionice i udjeli u glavnici ostalih financijskih institucija u javnom sektoru",466,null,null,"-"]
[832,"Primici od prodaje dionica i udjela u glavnici trgovačkih društava u javnom sektoru",467,null,null,"-"]
[833,"Primici od prodaje dionica i udjela u glavnici kreditnih i ostalih financijskih institucija izvan javnog sektora (AOP 469+470)",468,{"$f":"SUM(D482:D483)","v":0},{"$f":"SUM(E482:E483)","v":0},"-"]
[8331,"Dionice i udjeli u glavnici tuzemnih kreditnih i ostalih financijskih institucija izvan javnog sektora ",469,null,null,"-"]
[8332,"Dionice i udjeli u glavnici inozemnih kreditnih i ostalih financijskih institucija ",470,null,null,"-"]
[834,"Primici od prodaje dionica i udjela u glavnici trgovačkih društava izvan javnog sektora (AOP 472+473)",471,{"$f":"SUM(D485:D486)","v":0},{"$f":"SUM(E485:E486)","v":0},"-"]
[8341,"Dionice i udjeli u glavnici tuzemnih trgovačkih društva izvan javnog sektora",472,null,null,"-"]
[8342,"Dionice i udjeli u glavnici inozemnih trgovačkih društava",473,null,null,"-"]
[84,"Primici od zaduživanja (AOP 475+480+484+485+492+497)",474,{"$f":"D488+D493+D497+D498+D505+D510","v":0},{"$f":"E488+E493+E497+E498+E505+E510","v":0},{"$f":"IF(D487<>0,IF(E487/D487>=100,\">>100\",E487/D487*100),\"-\")","v":"-"}]
[841,"Primljeni krediti i zajmovi od međunarodnih organizacija, institucija i tijela EU te inozemnih vlada (AOP 476 do 479)",475,{"$f":"SUM(D489:D492)","v":0},{"$f":"SUM(E489:E492)","v":0},"-"]
[8413,"Primljeni zajmovi od međunarodnih organizacija",476,null,null,"-"]
[8414,"Primljeni krediti i zajmovi od institucija i tijela EU",477,null,null,"-"]
[8415,"Primljeni zajmovi od inozemnih vlada u EU",478,null,null,"-"]
[8416,"Primljeni zajmovi od inozemnih vlada izvan EU",479,null,null,"-"]
[842,"Primljeni krediti i zajmovi od kreditnih i ostalih financijskih institucija u javnom sektoru (AOP 481 do 483)",480,{"$f":"SUM(D494:D496)","v":0},{"$f":"SUM(E494:E496)","v":0},"-"]
[8422,"Primljeni krediti od kreditnih institucija u javnom sektoru",481,null,null,"-"]
[8423,"Primljeni zajmovi od osiguravajućih društava u javnom sektoru",482,null,null,"-"]
[8424,"Primljeni zajmovi od ostalih financijskih institucija u javnom sektoru",483,null,null,"-"]
[843,"Primljeni zajmovi od trgovačkih društava u javnom sektoru",484,null,null,"-"]
[844,"Primljeni krediti i zajmovi od kreditnih i ostalih financijskih institucija izvan javnog sektora (AOP 486 do 491)",485,{"$f":"SUM(D499:D504)","v":0},{"$f":"SUM(E499:E504)","v":0},"-"]
[8443,"Primljeni krediti od tuzemnih kreditnih institucija izvan javnog sektora",486,null,null,"-"]
[8444,"Primljeni zajmovi od tuzemnih osiguravajućih društava izvan javnog sektora",487,null,null,"-"]
[8445,"Primljeni zajmovi od ostalih tuzemnih financijskih institucija izvan javnog sektora",488,null,null,"-"]
[8446,"Primljeni krediti od inozemnih kreditnih institucija",489,null,null,"-"]
[8447,"Primljeni zajmovi od inozemnih osiguravajućih društava",490,null,null,"-"]
[8448,"Primljeni zajmovi od ostalih inozemnih financijskih institucija",491,null,null,"-"]
[845,"Primljeni zajmovi od trgovačkih društava i obrtnika izvan javnog sektora (AOP 493 do 496)",492,{"$f":"SUM(D506:D509)","v":0},{"$f":"SUM(E506:E509)","v":0},"-"]
[8453,"Primljeni zajmovi od tuzemnih trgovačkih društava izvan javnog sektora",493,null,null,"-"]
[8454,"Primljeni zajmovi od tuzemnih obrtnika",494,null,null,"-"]
[8455,"Primljeni zajmovi od inozemnih trgovačkih društava",495,null,null,"-"]
[8456,"Primljeni zajmovi od inozemnih obrtnika",496,null,null,"-"]
[847,"Primljeni zajmovi od drugih razina vlasti (AOP 498 do 504)",497,{"$f":"SUM(D511:D517)","v":0},{"$f":"SUM(E511:E517)","v":0},"-"]
[8471,"Primljeni zajmovi od državnog proračuna",498,null,null,"-"]
[8472,"Primljeni zajmovi od županijskih proračuna",499,null,null,"-"]
[8473,"Primljeni zajmovi od gradskih proračuna",500,null,null,"-"]
[8474,"Primljeni zajmovi od općinskih proračuna",501,null,null,"-"]
[8475,"Primljeni zajmovi od HZMO-a, HZZ-a i HZZO-a",502,null,null,"-"]
[8476,"Primljeni zajmovi od ostalih izvanproračunskih korisnika državnog proračuna",503,null,null,"-"]
["8477","Primljeni zajmovi od izvanproračunskih korisnika županijskih, gradskih i općinskih proračuna",504,null,null,"-"]
[85,"Primici od prodaje vrijednosnih papira iz portfelja (AOP 506+509+512+515)",505,{"$f":"D519+D522+D525+D528","v":0},{"$f":"E519+E522+E525+E528","v":0},"-"]
[851,"Primici za komercijalne i blagajničke zapise (AOP 507+508)",506,{"$f":"SUM(D520:D521)","v":0},{"$f":"SUM(E520:E521)","v":0},"-"]
[8511,"Komercijalni i blagajnički zapisi – tuzemni",507,null,null,"-"]
[8512,"Komercijalni i blagajnički zapisi – inozemni",508,null,null,"-"]
[852,"Primici za obveznice (AOP 510+511)",509,{"$f":"SUM(D523:D524)","v":0},{"$f":"SUM(E523:E524)","v":0},"-"]
[8521,"Obveznice – tuzemne",510,null,null,"-"]
[8522,"Obveznice – inozemne",511,null,null,"-"]
[853,"Primici za opcije i druge financijske derivate (AOP 513+514)",512,{"$f":"SUM(D526:D527)","v":0},{"$f":"SUM(E526:E527)","v":0},"-"]
[8531,"Opcije i drugi financijski derivati – tuzemni",513,null,null,"-"]
[8532,"Opcije i drugi financijski derivati – inozemni",514,null,null,"-"]
[854,"Primci za ostale vrijednosne papire (AOP 516+517)",515,{"$f":"SUM(D529:D530)","v":0},{"$f":"SUM(E529:E530)","v":0},"-"]
[8541,"Ostali tuzemni vrijednosni papiri",516,null,null,"-"]
[8542,"Ostali inozemni vrijednosni papiri",517,null,null,"-"]
[5,"Izdaci za financijsku imovinu i otplate zajmova (AOP 519+557+570+583+615)",518,{"$f":"D532+D570+D583+D596+D628","v":0},{"$f":"E532+E570+E583+E596+E628","v":0},"-"]
[51,"Izdaci za dane zajmove i depozite (AOP 520+525+528+532+533+540+545+553)",519,{"$f":"D533+D538+D541+D545+D546+D553+D558+D566","v":0},{"$f":"E533+E538+E541+E545+E546+E553+E558+E566","v":0},"-"]
[511,"Izdaci za dane zajmove međunarodnim organizacijama, institucijama i tijelima EU te inozemnim vladama (AOP 521 do 524)",520,{"$f":"SUM(D534:D537)","v":0},{"$f":"SUM(E534:E537)","v":0},"-"]
[5113,"Dani zajmovi međunarodnim organizacijama",521,null,null,"-"]
[5114,"Dani zajmovi institucijama i tijelima EU",522,null,null,"-"]
[5115,"Dani zajmovi inozemnim vladama u EU",523,null,null,"-"]
[5116,"Dani zajmovi inozemnim vladama izvan EU",524,null,null,"-"]
[512,"Izdaci za dane zajmove neprofitnim organizacijama, građanima i kućanstvima (AOP 526+527)",525,{"$f":"SUM(D539:D540)","v":0},{"$f":"SUM(E539:E540)","v":0},"-"]
[5121,"Dani zajmovi neprofitnim organizacijama, građanima i kućanstvima u tuzemstvu",526,null,null,"-"]
[5122,"Dani zajmovi neprofitnim organizacijama, građanima i kućanstvima u inozemstvu",527,null,null,"-"]
[513,"Izdaci za dane zajmove kreditnim i ostalim financijskim institucijama u javnom sektoru (AOP 529 do 531)",528,{"$f":"SUM(D542:D544)","v":0},{"$f":"SUM(E542:E544)","v":0},"-"]
[5132,"Dani zajmovi kreditnim institucijama u javnom sektoru",529,null,null,"-"]
[5133,"Dani zajmovi osiguravajućim društvima u javnom sektoru",530,null,null,"-"]
[5134,"Dani zajmovi ostalim financijskim institucijama u javnom sektoru",531,null,null,"-"]
[514,"Izdaci za dane zajmove trgovačkim društvima u javnom sektoru",532,null,null,"-"]
[515,"Izdaci za dane zajmove kreditnim i ostalim financijskim institucijama izvan javnog sektora (AOP 534 do 539)",533,{"$f":"SUM(D547:D552)","v":0},{"$f":"SUM(E547:E552)","v":0},"-"]
[5153,"Dani zajmovi tuzemnim kreditnim institucijama izvan javnog sektora",534,null,null,"-"]
[5154,"Dani zajmovi tuzemnim osiguravajućim društvima izvan javnog sektora",535,null,null,"-"]
[5155,"Dani zajmovi ostalim tuzemnim financijskim institucijama izvan javnog sektora",536,null,null,"-"]
[5156,"Dani zajmovi inozemnim kreditnim institucijama",537,null,null,"-"]
[5157,"Dani zajmovi inozemnim osiguravajućim društvima",538,null,null,{"$f":"IF(D551<>0,IF(E551/D551>=100,\">>100\",E551/D551*100),\"-\")","v":"-"}]
[5158,"Dani zajmovi ostalim inozemnim financijskim institucijama",539,null,null,"-"]
[516,"Izdaci za dane zajmove trgovačkim društvima i obrtnicima izvan javnog sektora (AOP 541 do 544)",540,{"$f":"SUM(D554:D557)","v":0},{"$f":"SUM(E554:E557)","v":0},"-"]
[5163,"Dani zajmovi tuzemnim trgovačkim društvima izvan javnog sektora",541,null,null,"-"]
[5164,"Dani zajmovi tuzemnim obrtnicima",542,null,null,"-"]
[5165,"Dani zajmovi inozemnim trgovačkim društvima",543,null,null,"-"]
[5166,"Dani zajmovi inozemnim obrtnicima",544,null,null,"-"]
[517,"Dani zajmovi drugim razinama vlasti (AOP 546 do 552)",545,{"$f":"SUM(D559:D565)","v":0},{"$f":"SUM(E559:E565)","v":0},"-"]
[5171,"Dani zajmovi državnom proračunu",546,null,null,"-"]
[5172,"Dani zajmovi županijskim proračunima",547,null,null,"-"]
[5173,"Dani zajmovi gradskim proračunima",548,null,null,"-"]
[5174,"Dani zajmovi općinskim proračunima",549,null,null,"-"]
[5175,"Dani zajmovi HZMO-u, HZZ-u i HZZO-u",550,null,null,"-"]
[5176,"Dani zajmovi ostalim izvanproračunskim korisnicima državnog proračuna",551,null,null,"-"]
[5177,"Dani zajmovi izvanproračunskim korisnicima županijskih, gradskih i općinskih proračuna",552,null,null,"-"]
["518","Izdaci za depozite i jamčevne pologe (AOP 554 do 556)",553,{"$f":"SUM(D567:D569)","v":0},{"$f":"SUM(E567:E569)","v":0},"-"]
["5181","Izdaci za depozite u kreditnim i ostalim financijskim institucijama - tuzemni",554,null,null,"-"]
["5182","Izdaci za depozite u kreditnim i ostalim financijskim institucijama - inozemni",555,null,null,"-"]
["5183","Izdaci za jamčevne pologe ",556,null,null,"-"]
[52,"Izdaci za ulaganja u vrijednosne papire (AOP 558+561+564+567)",557,{"$f":"D571+D574+D577+D580","v":0},{"$f":"E571+E574+E577+E580","v":0},"-"]
[521,"Izdaci za komercijalne i blagajničke zapise (AOP 559+560)",558,{"$f":"SUM(D572:D573)","v":0},{"$f":"SUM(E572:E573)","v":0},"-"]
[5211,"Komercijalni i blagajnički zapisi - tuzemni ",559,null,null,"-"]
[5212,"Komercijalni i blagajnički zapisi - inozemni",560,null,null,"-"]
[522,"Izdaci za obveznice (AOP 562+563)",561,{"$f":"SUM(D575:D576)","v":0},{"$f":"SUM(E575:E576)","v":0},"-"]
[5221,"Obveznice - tuzemne",562,null,null,"-"]
[5222,"Obveznice - inozemne",563,null,null,"-"]
[523,"Izdaci za opcije i druge financijske derivate (AOP 565+566)",564,{"$f":"SUM(D578:D579)","v":0},{"$f":"SUM(E578:E579)","v":0},"-"]
[5231,"Opcije i drugi financijski derivati - tuzemni",565,null,null,"-"]
[5232,"Opcije i drugi financijski derivati - inozemni",566,null,null,"-"]
[524,"Izdaci za ostale vrijednosne papire (AOP 568+569)",567,{"$f":"SUM(D581:D582)","v":0},{"$f":"SUM(E581:E582)","v":0},"-"]
[5241,"Ostali tuzemni vrijednosni papiri ",568,null,null,"-"]
[5242,"Ostali inozemni vrijednosni papiri",569,null,null,"-"]
[53,"Izdaci za dionice i udjele u glavnici (AOP 571+575+577+580)",570,{"$f":"D584+D588+D590+D593","v":0},{"$f":"E584+E588+E590+E593","v":0},"-"]
[531,"Dionice i udjeli u glavnici kreditnih i ostalih financijskih institucija u javnom sektoru (AOP 572 do 574)",571,{"$f":"SUM(D585:D587)","v":0},{"$f":"SUM(E585:E587)","v":0},"-"]
[5312,"Dionice i udjeli u glavnici kreditnih institucija u javnom sektoru",572,null,null,"-"]
[5313,"Dionice i udjeli u glavnici osiguravajućih društava u javnom sektoru",573,null,null,"-"]
[5314,"Dionice i udjeli u glavnici ostalih financijskih institucija u javnom sektoru",574,null,null,"-"]
[532,"Dionice i udjeli u glavnici trgovačkih društava u javnom sektoru (AOP 576)",575,{"$f":"D589","v":0},{"$f":"E589","v":0},"-"]
[5321,"Dionice i udjeli u glavnici trgovačkih društava u javnom sektoru",576,null,null,"-"]
[533,"Dionice i udjeli u glavnici kreditnih i ostalih financijskih institucija izvan javnog sektora (AOP 578+579)",577,{"$f":"SUM(D591:D592)","v":0},{"$f":"SUM(E591:E592)","v":0},"-"]
[5331,"Dionice i udjeli u glavnici tuzemnih kreditnih i ostalih financijskih institucija izvan javnog sektora",578,null,null,"-"]
[5332,"Dionice i udjeli u glavnici inozemnih kreditnih i ostalih financijskih institucija",579,null,null,"-"]
[534,"Dionice i udjeli u glavnici trgovačkih društava izvan javnog sektora (AOP 581+582)",580,{"$f":"SUM(D594:D595)","v":0},{"$f":"SUM(E594:E595)","v":0},"-"]
[5341,"Dionice i udjeli u glavnici tuzemnih trgovačkih društava izvan javnog sektora",581,null,null,"-"]
[5342,"Dionice i udjeli u glavnici inozemnih trgovačkih društava",582,null,null,"-"]
[54,"Izdaci za otplatu glavnice primljenih kredita i zajmova (AOP 584+589+593+595+602+607)",583,{"$f":"D597+D602+D606+D608+D615+D620","v":0},{"$f":"E597+E602+E606+E608+E615+E620","v":0},"-"]
[541,"Otplata glavnice primljenih kredita i zajmova od međunarodnih organizacija, institucija i tijela EU te inozemnih vlada (AOP 585 do 588)",584,{"$f":"SUM(D598:D601)","v":0},{"$f":"SUM(E598:E601)","v":0},"-"]
[5413,"Otplata glavnice primljenih zajmova od međunarodnih organizacija",585,null,null,"-"]
[5414,"Otplata glavnice primljenih kredita i zajmova od institucija i tijela EU",586,null,null,"-"]
[5415,"Otplata glavnice primljenih zajmova od inozemnih vlada u EU",587,null,null,"-"]
[5416,"Otplata glavnice primljenih zajmova od inozemnih vlada izvan EU",588,null,null,"-"]
[542,"Otplata glavnice primljenih kredita i zajmova od kreditnih i ostalih financijskih institucija u javnom sektoru (AOP 590 do 592)",589,{"$f":"SUM(D603:D605)","v":0},{"$f":"SUM(E603:E605)","v":0},"-"]
[5422,"Otplata glavnice primljenih kredita od kreditnih institucija u javnom sektoru",590,null,null,"-"]
[5423,"Otplata glavnice primljenih zajmova od osiguravajućih društava u javnom sektoru",591,null,null,"-"]
[5424,"Otplata glavnice primljenih zajmova od ostalih financijskih institucija u javnom sektoru",592,null,null,"-"]
[543,"Otplata glavnice primljenih zajmova od trgovačkih društava u javnom sektoru (AOP 594)",593,{"$f":"D607","v":0},{"$f":"E607","v":0},"-"]
[5431,"Otplata glavnice primljenih zajmova od trgovačkih društava u javnom sektoru",594,null,null,"-"]
[544,"Otplata glavnice primljenih kredita i zajmova od kreditnih i ostalih financijskih institucija izvan javnog sektora (AOP 596 do 601)",595,{"$f":"SUM(D609:D614)","v":0},{"$f":"SUM(E609:E614)","v":0},"-"]
[5443,"Otplata glavnice primljenih kredita od tuzemnih kreditnih institucija izvan javnog sektora",596,null,null,"-"]
[5444,"Otplata glavnice primljenih zajmova od tuzemnih osiguravajućih društava izvan javnog sektora",597,null,null,"-"]
[5445,"Otplata glavnice primljenih zajmova od ostalih tuzemnih financijskih institucija izvan javnog sektora",598,null,null,"-"]
[5446,"Otplata glavnice primljenih kredita od inozemnih kreditnih institucija",599,null,null,"-"]
[5447,"Otplata glavnice primljenih zajmova od inozemnih osiguravajućih društava",600,null,null,"-"]
[5448,"Otplata glavnice primljenih zajmova od ostalih inozemnih financijskih institucija",601,null,null,"-"]
[545,"Otplata glavnice primljenih zajmova od trgovačkih društava i obrtnika izvan javnog sektora (AOP 603 do 606)",602,{"$f":"SUM(D616:D619)","v":0},{"$f":"SUM(E616:E619)","v":0},{"$f":"IF(D615<>0,IF(E615/D615>=100,\">>100\",E615/D615*100),\"-\")","v":"-"}]
[5453,"Otplata glavnice primljenih zajmova od tuzemnih trgovačkih društava izvan javnog sektora",603,null,null,"-"]
[5454,"Otplata glavnice primljenih zajmova od tuzemnih obrtnika",604,null,null,"-"]
[5455,"Otplata glavnice primljenih zajmova od inozemnih trgovačkih društava",605,null,null,"-"]
[5456,"Otplata glavnice primljenih zajmova od inozemnih obrtnika",606,null,null,"-"]
[547,"Otplata glavnice primljenih zajmova od drugih razina vlasti (AOP 608 do 614)",607,{"$f":"SUM(D621:D627)","v":0},{"$f":"SUM(E621:E627)","v":0},"-"]
[5471,"Otplata glavnice primljenih zajmova od državnog proračuna",608,null,null,"-"]
[5472,"Otplata glavnice primljenih zajmova od županijskih proračuna",609,null,null,"-"]
[5473,"Otplata glavnice primljenih zajmova od gradskih proračuna",610,null,null,"-"]
[5474,"Otplata glavnice primljenih zajmova od općinskih proračuna",611,null,null,"-"]
[5475,"Otplata glavnice primljenih zajmova od HZMO-a, HZZ-a i HZZO-a",612,null,null,"-"]
[5476,"Otplata glavnice primljenih zajmova od ostalih izvanproračunskih korisnika državnog proračuna",613,null,null,"-"]
[5477,"Otplata glavnice primljenih zajmova od izvanproračunskih korisnika županijskih, gradskih i općinskih proračuna",614,null,null,"-"]
[55,"Izdaci za otplatu glavnice za izdane vrijednosne papire (AOP 616+619+622)",615,{"$f":"D629+D632+D635","v":0},{"$f":"E629+E632+E635","v":0},"-"]
[551,"Izdaci za otplatu glavnice za izdane trezorske zapise (AOP 617+618)",616,{"$f":"SUM(D630:D631)","v":0},{"$f":"SUM(E630:E631)","v":0},"-"]
[5511,"Izdaci za otplatu glavnice za izdane trezorske zapise u zemlji",617,null,null,"-"]
[5512,"Izdaci za otplatu glavnice za izdane trezorske zapise u inozemstvu",618,null,null,"-"]
[552,"Izdaci za otplatu glavnice za izdane obveznice (AOP 620+621)",619,{"$f":"SUM(D633:D634)","v":0},{"$f":"SUM(E633:E634)","v":0},"-"]
[5521,"Izdaci za otplatu glavnice za izdane obveznice u zemlji",620,null,null,"-"]
[5522,"Izdaci za otplatu glavnice za izdane obveznice u inozemstvu",621,null,null,"-"]
[553,"Izdaci za otplatu glavnice za izdane ostale vrijednosne papire (AOP 623+624)",622,{"$f":"SUM(D636:D637)","v":0},{"$f":"SUM(E636:E637)","v":0},"-"]
[5531,"Izdaci za otplatu glavnice za izdane ostale vrijednosne papire u zemlji",623,null,null,"-"]
[5532,"Izdaci za otplatu glavnice za izdane ostale vrijednosne papire u inozemstvu",624,null,null,"-"]
[" ","VIŠAK PRIMITAKA OD FINANCIJSKE IMOVINE I OBVEZA (AOP 410-518)",625,{"$f":"IF(D423-D531>=0,D423-D531,0)","v":0},{"$f":"IF(E423-E531>=0,E423-E531,0)","v":0},"-"]
[" ","MANJAK PRIMITAKA OD FINANCIJSKE IMOVINE I OBVEZA (AOP 518-410)",626,{"$f":"IF(D531-D423>=0,D531-D423,0)","v":0},{"$f":"IF(E531-E423>=0,E531-E423,0)","v":0},"-"]
[92213,"Višak primitaka od financijske imovine - preneseni ",627,null,null,"-"]
[92223,"Manjak primitaka od financijske imovine - preneseni",628,null,null,"-"]
[" ","UKUPNI PRIHODI I PRIMICI (AOP 403+410)",629,{"$f":"D415+D423","v":7377585},{"$f":"E415+E423","v":7821214},106.01320079673768]
[" ","UKUPNI RASHODI I IZDACI (AOP 404+518)",630,{"$f":"D416+D531","v":7358507},{"$f":"E416+E531","v":7894608},107.28545885734701]
[" ","VIŠAK PRIHODA I PRIMITAKA (AOP 629-630)",631,{"$f":"IF(D642>=D643,D642-D643,0)","v":19078},{"$f":"IF(E642>=E643,E642-E643,0)","v":0},0]
[" ","MANJAK PRIHODA I PRIMITAKA (AOP 630-629)",632,{"$f":"IF(D643>=D642,D643-D642,0)","v":0},{"$f":"IF(E643>=E642,E643-E642,0)","v":73394},"-"]
["9221-9222","Višak prihoda i primitaka - preneseni (AOP 407-408+627-628)",633,{"$f":"IF(D419-D420+D640-D641>=0,D419-D420+D640-D641,0)","v":66867},{"$f":"IF(E419-E420+E640-E641>=0,E419-E420+E640-E641,0)","v":85944},128.52976804701871]
["9222-9221","Manjak prihoda i primitaka - preneseni (AOP 408-407+628-627)",634,{"$f":"IF(D420-D419+D641-D640>=0,D420-D419+D641-D640,0)","v":0},{"$f":"IF(E420-E419+E641-E640>=0,E420-E419+E641-E640,0)","v":0},"-"]
[" ","Višak prihoda i primitaka raspoloživ u sljedećem razdoblju (AOP 631+633-632-634)",635,{"$f":"IF(D644+D646-D645-D647>=0,D644+D646-D645-D647,0)","v":85945},{"$f":"IF(E644+E646-E645-E647>=0,E644+E646-E645-E647,0)","v":12550},14.602361975682122]
[" ","Manjak prihoda i primitaka za pokriće u sljedećem razdoblju (AOP 632+634-631-633)",636,{"$f":"IF(D645+D647-D644-D646>=0,D645+D647-D644-D646,0)","v":0},{"$f":"IF(E645+E647-E644-E646>=0,E645+E647-E644-E646,0)","v":0},"-"]
["19","Unaprijed plaćeni rashodi budućih razdoblja i nedospjela naplata prihoda (aktivna vremenska razgraničenja)",637,493034,561501,113.88687189930107]
["Obvezni analitički podaci"]
[11,"Stanje novčanih sredstava na početku izvještajnog razdoblja",638,166710,205268,{"$f":"IF(D652<>0,IF(E652/D652>=100,\">>100\",E652/D652*100),\"-\")","v":123.12878651550596}]
["11-dugov.","Ukupni priljevi na novčane račune i blagajne",639,1465049,1738711,118.6793752290879]
["11-potraž.","Ukupni odljevi s novčanih računa i blagajni",640,1426491,1816493,127.33995517672388]
[11,"Stanje novčanih sredstava na kraju izvještajnog razdoblja (638+639-640)",641,{"$f":"+D652+D653-D654","v":205268},{"$f":"+E652+E653-E654","v":127486},62.107099012023305]
[" ","Prosječan broj zaposlenih u tijelima na osnovi stanja na početku i na kraju izvještajnog razdoblja (cijeli broj)",642,null,null,"-"]
[" ","Prosječan broj zaposlenih kod korisnika na osnovi stanja na početku i na kraju izvještajnog razdoblja (cijeli broj)",643,54,56,103.7037037037037]
[" ","Prosječan broj zaposlenih u tijelima na osnovi sati rada (cijeli broj)",644,null,null,"-"]
[" ","Prosječan broj zaposlenih kod korisnika na osnovi sati rada (cijeli broj)",645,52,53,101.92307692307692]
["dio 611","Ostvareni prihodi iz dodatnog udjela poreza na dohodak za decentralizirane funkcije",646,null,null,"-"]
[61315,"Porez na korištenje javnih površina",647,null,null,"-"]
[61451,"Porez na cestovna motorna vozila",648,null,null,"-"]
[61453,"Porez na tvrtku odnosno naziv tvrtke",649,null,null,"-"]
[63311,"Tekuće pomoći iz državnog proračuna",650,3366,null,0]
[63312,"Tekuće pomoći iz županijskih proračuna",651,null,null,"-"]
[63313,"Tekuće pomoći iz gradskih proračuna",652,null,null,"-"]
[63314,"Tekuće pomoći iz općinskih proračuna",653,null,null,"-"]
[63321,"Kapitalne pomoći iz državnog proračuna",654,null,null,"-"]
[63322,"Kapitalne pomoći iz županijskih proračuna",655,null,null,"-"]
[63323,"Kapitalne pomoći iz gradskih proračuna",656,null,null,"-"]
[63324,"Kapitalne pomoći iz općinskih proračuna",657,null,null,"-"]
[63414,"Tekuće pomoći od HZMO-a, HZZ-a i HZZO-a ",658,null,null,"-"]
[63415,"Tekuće pomoći od ostalih izvanproračunskih korisnika državnog proračuna",659,null,null,"-"]
[63416,"Tekuće pomoći od izvanproračunskih korisnika županijskih, gradskih i općinskih proračuna",660,null,null,"-"]
[63424,"Kapitalne pomoći od HZMO-a, HZZ-a i HZZO-a ",661,null,null,"-"]
[63425,"Kapitalne pomoći od ostalih izvanproračunskih korisnika državnog proračuna",662,null,null,"-"]
[63426,"Kapitalne pomoći od izvanproračunskih korisnika županijskih, gradskih i općinskih proračuna",663,null,null,"-"]
[63612,"Tekuće pomoći iz državnog proračuna proračunskim korisnicima proračuna JLP(R)S",664,5902015,6257250]
[63613,"Tekuće pomoći proračunskim korisnicima iz proračuna JLP(R)S koji im nije nadležan",665]
[63622,"Kapitalne pomoći iz državnog proračuna proračunskim korisnicima proračuna JLP(R)S",666]
[63623,"Kapitalne pomoći proračunskim korisnicima iz proračuna JLP(R)S koji im nije nadležan",667]
[63811,"Tekuće pomoći iz državnog proračuna temeljem prijenosa EU sredstava",668]
[63812,"Tekuće pomoći iz proračuna JLP(R)S temeljem prijenosa EU sredstava",669]
["63813","Tekuće pomoći od proračunskog korisnika drugog proračuna temeljem prijenosa EU sredstava",670]
["63814","Tekuće pomoći od izvanproračunskog korisnika temeljem prijenosa EU sredstava",671]
[63821,"Kapitalne pomoći iz državnog proračuna temeljem prijenosa EU sredstava",672]
[63822,"Kapitalne pomoći iz proračuna JLP(R)S temeljem prijenosa EU sredstava",673]
["63823","Kapitalne pomoći od proračunskog korisnika drugog proračuna temeljem prijenosa EU sredstava",674]
["63824","Kapitalne pomoći od izvanproračunskog korisnika temeljem prijenosa EU sredstava",675]
[64191,"Premije na izdane vrijednosne papire",676,null,null,{"$f":"IF(D690<>0,IF(E690/D690>=100,\">>100\",E690/D690*100),\"-\")","v":"-"}]
[64371,"Prihodi od kamata na dane zajmove državnom proračunu",677,null,null,"-"]
[64372,"Prihodi od kamata na dane zajmove županijskim proračunima",678,null,null,"-"]
[64373,"Prihodi od kamata na dane zajmove gradskim proračunima",679,null,null,"-"]
[64374,"Prihodi od kamata na dane zajmove općinskim proračunima",680,null,null,"-"]
[64375,"Prihodi od kamata na dane zajmove HZMO-u, HZZ-u i HZZO-u",681,null,null,"-"]
[64376,"Prihodi od kamata na dane zajmove ostalim izvanproračunskim korisnicima državnog proračuna",682,null,null,"-"]
[64377,"Prihodi od kamata na dane zajmove izvanproračunskim korisnicima županijskih, gradskih i općinskih proračuna",683,null,null,"-"]
[65264,"Sufinanciranje cijene usluge, participacije i slično",684,484200,480507,99.23729863692688]
[65265,"Dopunsko zdravstveno osiguranje",685,null,null,"-"]
["65267","Prihodi s naslova osiguranja, refundacije štete i totalne štete",686]
[31214,"Otpremnine",687,12038,23952,{"$f":"IF(D701<>0,IF(E701/D701>=100,\">>100\",E701/D701*100),\"-\")","v":198.9699285595614}]
[31215,"Naknade za bolest, invalidnost i smrtni slučaj",688,17467,28538,{"$f":"IF(D702<>0,IF(E702/D702>=100,\">>100\",E702/D702*100),\"-\")","v":163.38237819888934}]
[32121,"Naknade za prijevoz na posao i s posla",689,104276,107166,{"$f":"IF(D703<>0,IF(E703/D703>=100,\">>100\",E703/D703*100),\"-\")","v":102.77149104300128}]
["32351","Zakupnine za zemljišta",690]
["32361","Obvezni i preventivni zdravstveni pregledi zaposlenika",691,13638,19414,{"$f":"IF(D705<>0,IF(E705/D705>=100,\">>100\",E705/D705*100),\"-\")","v":142.35225106320576}]
["32371","Autorski honorari",692,null,null,{"$f":"IF(D706<>0,IF(E706/D706>=100,\">>100\",E706/D706*100),\"-\")","v":"-"}]
["32372","Ugovori o djelu",693,15732,18609,{"$f":"IF(D707<>0,IF(E707/D707>=100,\">>100\",E707/D707*100),\"-\")","v":118.28756674294432}]
["32377","Usluge agencija, studentskog servisa (prijepisi, prijevodi i drugo)",694,null,null,{"$f":"IF(D708<>0,IF(E708/D708>=100,\">>100\",E708/D708*100),\"-\")","v":"-"}]
["32398","Naknada za energetsku uslugu",695,19683,17381]
[32911,"Naknade za rad članovima predstavničkih i izvršnih tijela i upravnih vijeća",696,null,null,{"$f":"IF(D710<>0,IF(E710/D710>=100,\">>100\",E710/D710*100),\"-\")","v":"-"}]
["32923","Premije osiguranja zaposlenih",697,null,null,"-"]
[34111,"Kamate za izdane trezorske zapise u zemlji",698,null,null,"-"]
[34112,"Kamate za izdane trezorske zapise u inozemstvu",699,null,null,"-"]
[34121,"Kamate za izdane mjenice u domaćoj valuti",700,null,null,"-"]
[34122,"Kamate za izdane mjenice u stranoj valuti",701,null,null,"-"]
[34131,"Kamate za izdane obveznice u zemlji",702,null,null,"-"]
[34132,"Kamate za izdane obveznice u inozemstvu",703,null,null,"-"]
[34191,"Kamate za ostale vrijednosne papire u zemlji",704,null,null,"-"]
[34192,"Kamate za ostale vrijednosne papire u inozemstvu",705,null,null,"-"]
[34213,"Kamate za primljene zajmove od međunarodnih organizacija",706,null,null,"-"]
[34214,"Kamate za primljene kredite i zajmove od institucija i tijela EU",707,null,null,"-"]
[34215,"Kamate za primljene zajmove od inozemnih vlada u EU",708,null,null,"-"]
[34216,"Kamate za primljene zajmove od inozemnih vlada izvan EU",709,null,null,"-"]
[34222,"Kamate za primljene kredite od kreditnih institucija u javnom sektoru",710,null,null,"-"]
[34223,"Kamate za primljene zajmove od osiguravajućih društava u javnom sektoru",711,null,null,"-"]
[34224,"Kamate za primljene zajmove od ostalih financijskih institucija u javnom sektoru",712,null,null,"-"]
[34233,"Kamate za primljene kredite od tuzemnih kreditnih institucija izvan javnog sektora",713,null,null,"-"]
[34234,"Kamate za primljene zajmove od tuzemnih osiguravajućih društava izvan javnog sektora",714,null,null,"-"]
[34235,"Kamate za primljene zajmove od ostalih tuzemnih financijskih institucija izvan javnog sektora",715,null,null,"-"]
[34236,"Kamate za primljene kredite od inozemnih kreditnih institucija",716,null,null,"-"]
[34237,"Kamate za primljene zajmove od inozemnih osiguravajućih društava",717,null,null,"-"]
[34238,"Kamate za primljene zajmove od ostalih inozemnih financijskih institucija",718,null,null,"-"]
[34273,"Kamate za primljene zajmove od tuzemnih trgovačkih društava izvan javnog sektora",719,null,null,"-"]
[34274,"Kamate za primljene zajmove od tuzemnih obrtnika",720,null,null,"-"]
[34275,"Kamate za primljene zajmove od inozemnih trgovačkih društava",721,null,null,"-"]
[34281,"Kamate za primljene zajmove od državnog proračuna",722,null,null,"-"]
[34282,"Kamate za primljene zajmove od županijskih proračuna",723,null,null,"-"]
[34283,"Kamate za primljene zajmove od gradskih proračuna",724,null,null,"-"]
[34284,"Kamate za primljene zajmove od općinskih proračuna",725,null,null,"-"]
[34285,"Kamate za primljene zajmove od HZMO-a, HZZ-a, HZZO-a",726,null,null,"-"]
[34286,"Kamate za primljene zajmove od ostalih izvanproračunskih korisnika državnog proračuna",727,null,null,"-"]
[34287,"Kamate za primljene zajmove od izvanproračunskih korisnika županijskih, gradskih i općinskih proračuna",728,null,null,"-"]
[34341,"Diskont na izdane vrijednosne papire",729,null,null,"-"]
[35231,"Subvencije poljoprivrednicima",730,null,null,"-"]
[35232,"Subvencije obrtnicima",731,null,null,"-"]
[36313,"Tekuće pomoći državnom proračunu",732,null,null,"-"]
[36314,"Tekuće pomoći županijskim proračunima",733,null,null,"-"]
[36315,"Tekuće pomoći gradskim proračunima",734,null,null,"-"]
[36316,"Tekuće pomoći općinskim proračunima",735,null,null,"-"]
[36317,"Tekuće pomoći HZMO-u, HZZ-u i HZZO-u",736,null,null,"-"]
[36318,"Tekuće pomoći ostalim izvanproračunskim korisnicima državnog proračuna",737,null,null,"-"]
[36319,"Tekuće pomoći izvanproračunskim korisnicima županijskih, gradskih i općinskih proračuna",738,null,null,"-"]
[36323,"Kapitalne pomoći državnom proračunu",739,null,null,"-"]
[36324,"Kapitalne pomoći županijskim proračunima",740,null,null,"-"]
[36325,"Kapitalne pomoći gradskim proračunima",741,null,null,"-"]
[36326,"Kapitalne pomoći općinskim proračunima",742,null,null,"-"]
[36327,"Kapitalne pomoći HZMO-u, HZZ-u i HZZO-u",743,null,null,"-"]
[36328,"Kapitalne pomoći ostalim izvanproračunskim korisnicima državnog proračuna",744,null,null,"-"]
[36329,"Kapitalne pomoći izvanproračunskim korisnicima županijskih, gradskih i općinskih proračuna",745,null,null,"-"]
["36811","Tekuće pomoći proračunskim korisnicima državnog proračuna temeljem prijenosa sredstava EU",746,null,null,"-"]
["36812","Tekuće pomoći proračunskim korisnicima županijskih proračuna temeljem prijenosa EU sredstava",747,null,null,"-"]
["36813","Tekuće pomoći proračunskim korisnicima gradskih proračuna temeljem prijenosa EU sredstava",748,null,null,"-"]
["36814","Tekuće pomoći proračunskim korisnicima općinskih proračuna temeljem prijenosa EU sredstava",749,null,null,"-"]
["36815","Tekuće pomoći županijskim proračunima temeljem prijenosa EU sredstava",750,null,null,"-"]
["36816","Tekuće pomoći gradskim proračunima temeljem prijenosa EU sredstava",751,null,null,"-"]
["36817","Tekuće pomoći općinskim proračunima temeljem prijenosa EU sredstava",752,null,null,"-"]
["36818","Tekuće pomoći izvanproračunskim korisnicima državnog proračuna temeljem prijenosa EU sredstava",753,null,null,"-"]
["36819","Tekuće pomoći izvanproračunskim korisnicima županijskih, gradskih i općinskih proračuna temeljem prijenosa EU sredstava",754,null,null,"-"]
["36821","Kapitalne pomoći proračunskim korisnicima državnog proračuna temeljem prijenosa sredstava EU",755,null,null,"-"]
["36822","Kapitalne pomoći proračunskim korisnicima županijskih proračuna temeljem prijenosa EU sredstava",756,null,null,"-"]
["36823","Kapitalne pomoći proračunskim korisnicima gradskih proračuna temeljem prijenosa EU sredstava",757,null,null,"-"]
["36824","Kapitalne pomoći proračunskim korisnicima općinskih proračuna temeljem prijenosa EU sredstava",758,null,null,"-"]
["36825","Kapitalne pomoći županijskim proračunima temeljem prijenosa EU sredstava",759,null,null,"-"]
["36826","Kapitalne pomoći gradskim proračunima temeljem prijenosa EU sredstava",760,null,null,{"$f":"IF(D774<>0,IF(E774/D774>=100,\">>100\",E774/D774*100),\"-\")","v":"-"}]
["36827","Kapitalne pomoći općinskim proračunima temeljem prijenosa EU sredstava",761,null,null,"-"]
["36828","Kapitalne pomoći izvanproračunskim korisnicima državnog proračuna temeljem prijenosa EU sredstava",762,null,null,"-"]
["36829","Kapitalne pomoći izvanproračunskim korisnicima županijskih, gradskih i općinskih proračuna temeljem prijenosa EU sredstava",763,null,null,"-"]
["37131","Naknade za bolest i invaliditet",764,null,null,"-"]
["37132","Naknade za zdravstvenu zaštitu u inozemstvu",765,null,null,"-"]
["37139","Ostale naknade na temelju osiguranja u novcu",766,null,null,"-"]
["37141","Medicinske (zdravstvene) usluge ",767,null,null,"-"]
["37143","Farmaceutski proizvodi",768,null,null,"-"]
["37144","Pomoć i njega u kući",769,null,null,"-"]
["37149","Ostale naknade na temelju osiguranja u naravi",770,null,null,"-"]
["37211","Naknade za dječji doplatak",771,null,null,"-"]
["37212","Pomoć obiteljima i kućanstvima",772,null,null,"-"]
["37213","Pomoć osobama s invaliditetom",773,null,null,"-"]
["37214","Naknade za mirovine i dodatke - posebni propis",774,null,null,"-"]
[37215,"Stipendije i školarine",775,null,null,"-"]
[37216,"Naknade za pomoć bivšim političkim zatvorenicima i neosnovano pritvorenim osobama",776,null,null,"-"]
[37217,"Porodiljne naknade i oprema za novorođenčad",777,null,null,"-"]
[37218,"Pomoć nezaposlenim osobama",778,null,null,"-"]
[37219,"Ostale naknade iz proračuna u novcu",779,null,null,"-"]
[37221,"Sufinanciranje cijene prijevoza",780,null,null,"-"]
["37222","Pomoć i njega u kući",781,null,null,"-"]
["37223","Stanovanje",782,null,null,"-"]
["37224","Prehrana",783,null,null,"-"]
["37229","Ostale naknade iz proračuna u naravi",784,null,null,"-"]
[38117,"Tekuće donacije građanima i kućanstvima",785,null,null,"-"]
[38612,"Kapitalne pomoći trgovačkim društvima u javnom sektoru",786,null,null,"-"]
[38613,"Kapitalne pomoći kreditnim institucijama u javnom sektoru",787,null,null,"-"]
[38614,"Kapitalne pomoći osiguravajućim društvima u javnom sektoru",788,null,null,"-"]
[38615,"Kapitalne pomoći ostalim financijskim institucijama u javnom sektoru",789,null,null,"-"]
[38622,"Kapitalne pomoći trgovačkim društvima izvan javnog sektora",790,null,null,"-"]
[38623,"Kapitalne pomoći kreditnim institucijama izvan javnog sektora",791,null,null,"-"]
[38624,"Kapitalne pomoći osiguravajućim društvima izvan javnog sektora",792,null,null,"-"]
[38625,"Kapitalne pomoći ostalim financijskim institucijama izvan javnog sektora",793,null,null,"-"]
["38626","Kapitalne pomoći zadrugama",794]
[38631,"Kapitalne pomoći poljoprivrednicima",795,null,null,"-"]
[38632,"Kapitalne pomoći obrtnicima",796,null,null,"-"]
[38641,"Kapitalne pomoći subjektima u javnom sektoru iz EU sredstava ",797]
["38642","Kapitalne pomoći subjektima izvan javnog sektora iz EU sredstava ",798]
[81212,"Povrat zajmova danih neprofitnim organizacijama, građanima i kućanstvima u tuzemstvu – dugoročni",799,null,null,"-"]
["81213","Povrat danih zajmova neprofitnim organizacijama, građanima i kućanstvima u tuzemstvu po protestiranim jamstvima",800,null,null,"-"]
[81322,"Povrat zajmova danih kreditnim institucijama u javnom sektoru – dugoročni",801,null,null,"-"]
["81323","Povrat danih zajmova kreditnim institucijama u javnom sektoru po protestiranim jamstvima",802,null,null,"-"]
[81332,"Povrat zajmova danih osiguravajućim društvima u javnom sektoru – dugoročni",803,null,null,"-"]
["81333","Povrat danih zajmova osiguravajućim društvima u javnom sektoru po protestiranim jamstvima",804,null,null,"-"]
[81342,"Povrat zajmova danih ostalim financijskim institucijama u javnom sektoru – dugoročni",805,null,null,"-"]
["81343","Povrat danih zajmova ostalim financijskim institucijama u javnom sektoru po protestiranim jamstvima",806,null,null,"-"]
[81411,"Povrat zajmova danih trgovačkim društvima u javnom sektoru – kratkoročni",807,null,null,"-"]
[81412,"Povrat zajmova danih trgovačkim društvima u javnom sektoru – dugoročni",808,null,null,"-"]
["81413","Povrat danih zajmova trgovačkim društvima u javnom sektoru po protestiranim jamstvima",809,null,null,"-"]
[81532,"Povrat zajmova danih tuzemnim kreditnim institucijama izvan javnog sektora – dugoročni",810,null,null,"-"]
["81533","Povrat danih zajmova tuzemnim kreditnim institucijama izvan javnog sektora po protestiranim jamstvima",811,null,null,"-"]
[81542,"Povrat zajmova danih tuzemnim osiguravajućim društvima izvan javnog sektora – dugoročni",812,null,null,"-"]
["81543","Povrat danih zajmova tuzemnim osiguravajućim društvima izvan javnog sektora po protestiranim jamstvima",813,null,null,"-"]
[81552,"Povrat zajmova danih ostalim tuzemnim financijskim institucijama izvan javnog sektora - dugoročni",814,null,null,"-"]
["81553","Povrat danih zajmova ostalim tuzemnim financijskim institucijama izvan javnog sektora po protestiranim jamstvima",815,null,null,"-"]
[81631,"Povrat zajmova danih tuzemnim trgovačkim društvima izvan javnog sektora - kratkoročni",816,null,null,"-"]
[81632,"Povrat zajmova danih tuzemnim trgovačkim društvima izvan javnog sektora - dugoročni",817,null,null,"-"]
["81633","Povrat danih zajmova tuzemnim trgovačkim društvima izvan javnog sektora po protestiranim jamstvima",818,null,null,"-"]
[81641,"Povrat zajmova danih tuzemnim obrtnicima - kratkoročni",819,null,null,"-"]
[81642,"Povrat zajmova danih tuzemnim obrtnicima - dugoročni",820,null,null,"-"]
["81643","Povrat danih zajmova tuzemnim obrtnicima po protestiranim jamstvima",821,null,null,"-"]
[81711,"Povrat zajmova danih državnom proračunu - kratkoročni",822,null,null,"-"]
[81712,"Povrat zajmova danih državnom proračunu - dugoročni",823,null,null,"-"]
[81721,"Povrat zajmova danih županijskim proračunima - kratkoročni",824,null,null,{"$f":"IF(D838<>0,IF(E838/D838>=100,\">>100\",E838/D838*100),\"-\")","v":"-"}]
[81722,"Povrat zajmova danih županijskim proračunima - dugoročni",825,null,null,"-"]
["81723","Povrat danih zajmova županijskim proračunima po protestiranim jamstvima",826,null,null,"-"]
[81731,"Povrat zajmova danih gradskim proračunima - kratkoročni",827,null,null,"-"]
[81732,"Povrat zajmova danih gradskim proračunima - dugoročni",828,null,null,"-"]
[81733,"Povrat danih zajmova gradskim proračunima po protestiranim jamstvima",829,null,null,"-"]
[81741,"Povrat zajmova danih općinskim proračunima - kratkoročni",830,null,null,"-"]
[81742,"Povrat zajmova danih općinskim proračunima - dugoročni",831,null,null,"-"]
[81743,"Povrat danih zajmova općinskim proračunima po protestiranim jamstvima",832,null,null,"-"]
[81751,"Povrat zajmova danih HZMO-u, HZZ-u i HZZO-u - kratkoročni",833,null,null,"-"]
[81752,"Povrat zajmova danih HZMO-u, HZZ-u i HZZO-u - dugoročni",834,null,null,"-"]
[81753,"Povrat danih zajmova HZMO-u, HZZ-u i HZZO-u po protestiranim jamstvima",835,null,null,"-"]
[81761,"Povrat zajmova danih ostalim izvanproračunskim korisnicima državnog proračuna - kratkoročni",836,null,null,"-"]
[81762,"Povrat zajmova danih ostalim izvanproračunskim korisnicima državnog proračuna - dugoročni",837,null,null,"-"]
[81763,"Povrat danih zajmova ostalim izvanproračunskim korisnicima državnog proračuna po protestiranim jamstvima",838,null,null,"-"]
[81771,"Povrat zajmova danih izvanproračunskim korisnicima županijskih, gradskih i općinskih proračuna - kratkoročni",839,null,null,"-"]
[81772,"Povrat zajmova danih izvanproračunskim korisnicima županijskih, gradskih i općinskih proračuna - dugoročni",840,null,null,"-"]
[81773,"Povrat danih zajmova izvanproračunskim korisnicima županijskih, gradskih i općinskih proračuna po protestiranim jamstvima",841,null,null,"-"]
[82412,"Ostali vrijednosni papiri - tuzemni - dugoročni",842,null,null,"-"]
[84132,"Primljeni zajmovi od međunarodnih organizacija - dugoročni",843,null,null,"-"]
[84142,"Primljeni krediti i zajmovi od institucija i tijela EU - dugoročni",844,null,null,"-"]
[84152,"Primljeni zajmovi od inozemnih vlada u EU - dugoročni",845,null,null,"-"]
[84162,"Primljeni zajmovi od inozemnih vlada izvan EU - dugoročni",846,null,null,"-"]
[84221,"Primljeni krediti od kreditnih institucija u javnom sektoru - kratkoročni",847,null,null,"-"]
[84222,"Primljeni krediti od kreditnih institucija u javnom sektoru - dugoročni",848,null,null,"-"]
["84223","Primljeni financijski leasing od kreditnih institucija u javnom sektoru",849,null,null,"-"]
[84232,"Primljeni zajmovi od osiguravajućih društava u javnom sektoru - dugoročni",850,null,null,"-"]
[84242,"Primljeni zajmovi od ostalih financijskih institucija u javnom sektoru - dugoročni",851,null,null,"-"]
["84243","Primljeni financijski leasing od ostalih financijskih institucija u javnom sektoru",852,null,null,"-"]
[84312,"Primljeni zajmovi od trgovačkih društava u javnom sektoru - dugoročni",853,null,null,"-"]
[84431,"Primljeni krediti od tuzemnih kreditnih institucija izvan javnog sektora - kratkoročni",854,null,null,"-"]
[84432,"Primljeni krediti od tuzemnih kreditnih institucija izvan javnog sektora - dugoročni",855,null,null,"-"]
["84433","Primljeni financijski leasing od tuzemnih kreditnih institucija izvan javnog sektora",856,null,null,"-"]
[84442,"Primljeni zajmovi od tuzemnih osiguravajućih društava izvan javnog sektora - dugoročni",857,null,null,"-"]
[84452,"Primljeni zajmovi od ostalih tuzemnih financijskih institucija izvan javnog sektora - dugoročni",858,null,null,"-"]
["84453","Primljeni financijski leasing od ostalih tuzemnih financijskih institucija izvan javnog sektora",859,null,null,"-"]
[84461,"Primljeni krediti od inozemnih kreditnih institucija - kratkoročni",860,null,null,"-"]
[84462,"Primljeni krediti od inozemnih kreditnih institucija - dugoročni",861,null,null,"-"]
["84463","Primljeni financijski leasing od inozemnih kreditnih institucija",862,null,null,"-"]
[84472,"Primljeni zajmovi od inozemnih osiguravajućih društava - dugoročni",863,null,null,"-"]
[84482,"Primljeni zajmovi od ostalih inozemnih financijskih institucija - dugoročni",864,null,null,"-"]
["84483","Primljeni financijski leasing od ostalih inozemnih financijskih institucija",865,null,null,"-"]
[84532,"Primljeni zajmovi od tuzemnih trgovačkih društava izvan javnog sektora - dugoročni",866,null,null,"-"]
[84542,"Primljeni zajmovi od tuzemnih obrtnika - dugoročni",867,null,null,"-"]
[84552,"Primljeni zajmovi od inozemnih trgovačkih društava - dugoročni",868,null,null,"-"]
[84711,"Primljeni zajmovi od državnog proračuna - kratkoročni",869,null,null,"-"]
[84712,"Primljeni zajmovi od državnog proračuna - dugoročni",870,null,null,"-"]
[84721,"Primljeni zajmovi od županijskih proračuna - kratkoročni",871,null,null,"-"]
[84722,"Primljeni zajmovi od županijskih proračuna - dugoročni",872,null,null,"-"]
[84731,"Primljeni zajmovi od gradskih proračuna - kratkoročni",873,null,null,"-"]
[84732,"Primljeni zajmovi od gradskih proračuna - dugoročni",874,null,null,"-"]
[84741,"Primljeni zajmovi od općinskih proračuna - kratkoročni",875,null,null,"-"]
[84742,"Primljeni zajmovi od općinskih proračuna - dugoročni",876,null,null,"-"]
[84751,"Primljeni zajmovi od HZMO-a, HZZ-a i HZZO-a - kratkoročni",877,null,null,"-"]
[84752,"Primljeni zajmovi od HZMO-a, HZZ-a i HZZO-a - dugoročni",878,null,null,"-"]
[84761,"Primljeni zajmovi od ostalih izvanproračunskih korisnika državnog proračuna - kratkoročni",879,null,null,"-"]
[84762,"Primljeni zajmovi od ostalih izvanproračunskih korisnika državnog proračuna - dugoročni",880,null,null,"-"]
["84771","Primljeni zajmovi od izvanproračunskih korisnika županijskih, gradskih i općinskih proračuna - kratkoročni",881,null,null,"-"]
["84772","Primljeni zajmovi od izvanproračunskih korisnika županijskih, gradskih i općinskih proračuna - dugoročni",882,null,null,"-"]
[85412,"Ostali tuzemni vrijednosni papiri - dugoročni",883,null,null,"-"]
[51212,"Dani zajmovi neprofitnim organizacijama, građanima i kućanstvima u tuzemstvu – dugoročni",884,null,null,"-"]
["51213","Dani zajmovi neprofitnim organizacijama, građanima i kućanstvima u tuzemstvu po protestiranim jamstvima",885,null,null,"-"]
[51322,"Dani zajmovi kreditnim institucijama u javnom sektoru – dugoročni",886,null,null,"-"]
["51323","Dani zajmovi kreditnim institucijama u javnom sektoru po protestiranim jamstvima",887,null,null,"-"]
[51332,"Dani zajmovi osiguravajućim društvima u javnom sektoru – dugoročni",888,null,null,{"$f":"IF(D902<>0,IF(E902/D902>=100,\">>100\",E902/D902*100),\"-\")","v":"-"}]
["51333","Dani zajmovi osiguravajućim društvima u javnom sektoru po protestiranim jamstvima",889,null,null,"-"]
[51342,"Dani zajmovi ostalim financijskim institucijama u javnom sektoru – dugoročni",890,null,null,"-"]
["51343","Dani zajmovi ostalim financijskim institucijama u javnom sektoru po protestiranim jamstvima",891,null,null,"-"]
[51411,"Dani zajmovi trgovačkim društvima u javnom sektoru – kratkoročni",892,null,null,"-"]
[51412,"Dani zajmovi trgovačkim društvima u javnom sektoru – dugoročni",893,null,null,"-"]
["51413","Dani zajmovi trgovačkim društvima u javnom sektoru po protestiranim jamstvima",894,null,null,"-"]
[51532,"Dani zajmovi tuzemnim kreditnim institucijama izvan javnog sektora – dugoročni",895,null,null,"-"]
["51533","Dani zajmovi tuzemnim kreditnim institucijama izvan javnog sektora po protestiranim jamstvima",896,null,null,"-"]
[51542,"Dani zajmovi tuzemnim osiguravajućim društvima izvan javnog sektora – dugoročni",897,null,null,"-"]
["51543","Dani zajmovi tuzemnim osiguravajućim društvima izvan javnog sektora po protestiranim jamstvima",898,null,null,"-"]
[51552,"Dani zajmovi ostalim tuzemnim financijskim institucijama izvan javnog sektora – dugoročni",899,null,null,"-"]
["51553","Dani zajmovi ostalim tuzemnim financijskim institucijama izvan javnog sektora po protestiranim jamstvima",900,null,null,"-"]
[51631,"Dani zajmovi tuzemnim trgovačkim društvima izvan javnog sektora – kratkoročni",901,null,null,"-"]
[51632,"Dani zajmovi tuzemnim trgovačkim društvima izvan javnog sektora – dugoročni",902,null,null,"-"]
["51633","Dani zajmovi tuzemnim trgovačkim društvima izvan javnog sektora po protestiranim jamstvima",903,null,null,"-"]
[51641,"Dani zajmovi tuzemnim obrtnicima – kratkoročni",904,null,null,"-"]
[51642,"Dani zajmovi tuzemnim obrtnicima – dugoročni",905,null,null,"-"]
["51643","Dani zajmovi tuzemnim obrtnicima po protestiranim jamstvima",906,null,null,"-"]
[51711,"Dani zajmovi državnom proračunu – kratkoročni",907,null,null,"-"]
[51712,"Dani zajmovi državnom proračunu – dugoročni",908,null,null,"-"]
[51721,"Dani zajmovi županijskim proračunima – kratkoročni",909,null,null,"-"]
[51722,"Dani zajmovi županijskim proračunima – dugoročni",910,null,null,"-"]
["51723","Dani zajmovi županijskim proračunima po protestiranim jamstvima",911,null,null,"-"]
[51731,"Dani zajmovi gradskim proračunima – kratkoročni",912,null,null,"-"]
[51732,"Dani zajmovi gradskim proračunima – dugoročni",913,null,null,"-"]
["51733","Dani zajmovi gradskim proračunima po protestiranim jamstvima",914,null,null,"-"]
[51741,"Dani zajmovi općinskim proračunima – kratkoročni",915,null,null,"-"]
[51742,"Dani zajmovi općinskim proračunima – dugoročni",916,null,null,"-"]
["51743","Dani zajmovi općinskim proračunima po protestiranim jamstvima",917,null,null,"-"]
[51751,"Dani zajmovi HZMO-u, HZZ-u i HZZO-u – kratkoročni",918,null,null,"-"]
[51752,"Dani zajmovi HZMO-u, HZZ-u i HZZO-u – dugoročni",919,null,null,"-"]
["51753","Dani zajmovi HZMO-u, HZZ-u i HZZO-u po protestiranim jamstvima",920,null,null,"-"]
[51761,"Dani zajmovi ostalim izvanproračunskim korisnicima državnog proračuna – kratkoročni",921,null,null,"-"]
[51762,"Dani zajmovi ostalim izvanproračunskim korisnicima državnog proračuna – dugoročni",922,null,null,"-"]
["51763","Dani zajmovi ostalim izvanproračunskim korisnicima državnog proračuna po protestiranim jamstvima",923,null,null,"-"]
[51771,"Dani zajmovi izvanproračunskim korisnicima županijskih, gradskih i općinskih proračuna – kratkoročni",924,null,null,"-"]
[51772,"Dani zajmovi izvanproračunskim korisnicima županijskih, gradskih i općinskih proračuna – dugoročni",925,null,null,"-"]
["51773","Dani zajmovi izvanproračunskim korisnicima županijskih, gradskih i općinskih proračuna po protestiranim jamstvima",926,null,null,"-"]
[54132,"Otplata glavnice primljenih zajmova od međunarodnih organizacija – dugoročnih",927,null,null,"-"]
[54142,"Otplata glavnice primljenih kredita i zajmova od institucija i tijela EU – dugoročnih",928,null,null,"-"]
[54152,"Otplata glavnice primljenih zajmova od inozemnih vlada u EU – dugoročnih",929,null,null,"-"]
[54162,"Otplata glavnice primljenih zajmova od inozemnih vlada izvan EU – dugoročnih",930,null,null,"-"]
[54221,"Otplata glavnice primljenih kredita od kreditnih institucija u javnom sektoru – kratkoročnih",931,null,null,"-"]
[54222,"Otplata glavnice primljenih kredita od kreditnih institucija u javnom sektoru – dugoročnih",932,null,null,"-"]
["54223","Otplata glavnice po financijskom leasingu od kreditnih institucija u javnom sektoru",933,null,null,"-"]
[54232,"Otplata glavnice primljenih zajmova od osiguravajućih društava u javnom sektoru – dugoročnih",934,null,null,"-"]
[54242,"Otplata glavnice primljenih zajmova od ostalih financijskih institucija u javnom sektoru – dugoročnih",935,null,null,"-"]
["54243","Otplata glavnice po financijskom leasingu od ostalih financijskih institucija u javnom sektoru",936,null,null,"-"]
[54312,"Otplata glavnice primljenih zajmova od trgovačkih društava u javnom sektoru – dugoročnih",937,null,null,"-"]
[54431,"Otplata glavnice primljenih kredita od tuzemnih kreditnih institucija izvan javnog sektora – kratkoročnih",938,null,null,"-"]
[54432,"Otplata glavnice primljenih kredita od tuzemnih kreditnih institucija izvan javnog sektora – dugoročnih",939,null,null,"-"]
["54433","Otplata glavnice po financijskom leasingu od tuzemnih kreditnih institucija izvan javnog sektora",940,null,null,"-"]
[54442,"Otplata glavnice primljenih zajmova od tuzemnih osiguravajućih društava izvan javnog sektora – dugoročnih",941,null,null,"-"]
[54452,"Otplata glavnice primljenih zajmova od ostalih tuzemnih financijskih institucija izvan javnog sektora – dugoročnih",942,null,null,"-"]
["54453","Otplata glavnice po financijskom leasingu od ostalih tuzemnih financijskih institucija izvan javnog sektora",943,null,null,"-"]
[54461,"Otplata glavnice primljenih kredita od inozemnih kreditnih institucija – kratkoročnih",944,null,null,"-"]
[54462,"Otplata glavnice primljenih kredita od inozemnih kreditnih institucija – dugoročnih",945,null,null,"-"]
["54463","Otplata glavnice po financijskom leasingu od inozemnih kreditnih institucija",946,null,null,"-"]
[54472,"Otplata glavnice primljenih zajmova od inozemnih osiguravajućih društava – dugoročnih",947,null,null,"-"]
[54482,"Otplata glavnice primljenih zajmova od ostalih inozemnih financijskih institucija – dugoročnih",948,null,null,"-"]
["54483","Otplata glavnice primljenog financijskog leasinga od ostalih inozemnih financijskih institucija",949,null,null,"-"]
[54532,"Otplata glavnice primljenih zajmova od tuzemnih trgovačkih društava izvan javnog sektora – dugoročnih",950,null,null,"-"]
[54542,"Otplata glavnice primljenih zajmova od tuzemnih obrtnika – dugoročnih",951,null,null,"-"]
[54552,"Otplata glavnice primljenih zajmova od inozemnih trgovačkih društava – dugoročnih",952,null,null,{"$f":"IF(D966<>0,IF(E966/D966>=100,\">>100\",E966/D966*100),\"-\")","v":"-"}]
[54711,"Otplata glavnice primljenih zajmova od državnog proračuna – kratkoročnih",953,null,null,"-"]
[54712,"Otplata glavnice primljenih zajmova od državnog proračuna – dugoročnih",954,null,null,"-"]
[54721,"Otplata glavnice primljenih zajmova od županijskih proračuna – kratkoročnih",955,null,null,"-"]
[54722,"Otplata glavnice primljenih zajmova od županijskih proračuna – dugoročnih",956,null,null,"-"]
[54731,"Otplata glavnice primljenih zajmova od gradskih proračuna – kratkoročnih",957,null,null,"-"]
[54732,"Otplata glavnice primljenih zajmova od gradskih proračuna – dugoročnih",958,null,null,"-"]
[54741,"Otplata glavnice primljenih zajmova od općinskih proračuna – kratkoročnih",959,null,null,"-"]
[54742,"Otplata glavnice primljenih zajmova od općinskih proračuna – dugoročnih",960,null,null,"-"]
[54751,"Otplata glavnice primljenih zajmova od HZMO-a, HZZ-a i HZZO-a – kratkoročnih",961,null,null,"-"]
[54752,"Otplata glavnice primljenih zajmova od HZMO-a, HZZ-a i HZZO-a – dugoročnih",962,null,null,"-"]
[54761,"Otplata glavnice primljenih zajmova od ostalih izvanproračunskih korisnika državnog proračuna – kratkoročnih",963,null,null,"-"]
[54762,"Otplata glavnice primljenih zajmova od ostalih izvanproračunskih korisnika državnog proračuna – dugoročnih",964,null,null,"-"]
[54771,"Otplata glavnice primljenih zajmova od izvanproračunskih korisnika županijskih, gradskih i općinskih proračuna – kratkoročnih",965,null,null,"-"]
[54772,"Otplata glavnice primljenih zajmova od izvanproračunskih korisnika županijskih, gradskih i općinskih proračuna – dugoročnih",966,null,null,"-"]
[55312,"Izdaci za otplatu glavnice za izdane ostale vrijednosne papire u zemlji – dugoročne",967,null,null,"-"]
["Obvezni dodatni podaci"]
["Račun iz rač. plana","OPIS","AOP","Stanje na kraju izvještajnog razdoblja"]
[1,2,3,4]
["26224,26233, 26244,26314","Obveze za zajmove po faktoringu od kreditnih institucija,  osiguravajućih društava, financijskih institucija i trgovačkih društava u javnom sektoru",968]
["26243","Obveze za financijski leasing od ostalih financijskih institucija u javnom sektoru",969]
["26453","Obveze za financijski leasing od ostalih tuzemnih financijskih institucija izvan javnog sektora",970]
[26454,"Obveze za zajmove po faktoringu od ostalih tuzemnih financijskih institucija izvan javnog sektora",971]
["26463","Obveze za financijski leasing od inozemnih kreditnih institucija",972]
["26464,26473, 26484,26554, 26564","Obveze za zajmove po faktoringu od inozemnih kreditnih institucija, inozemnih osiguravajućih društava, ostalih inozemnih financijskih institucija, inozemnih trgovačkih društava i inozemnih obrtnika",973]
["26483","Obveze za financijski leasing od ostalih inozemnih financijskih institucija",974]
[26534,"Obveze za zajmove po faktoringu od tuzemnih trgovačkih društava izvan javnog sektora",975]
[]
["U _________________________________________, dana: ____.____.________.",null,null,"Odgoovorna osoba (potpis)"]
[{"$f":"IF(RefStr!H25<>\"\", \"Osoba za kontaktiranje: \" & RefStr!H25,\"Osoba za kontaktiranje: _________________________________________\")","v":"Osoba za kontaktiranje: Robertina Filić"}]
[{"$f":"IF(RefStr!H27=\"\",\"Telefon za kontakt: _________________\",\"Telefon za kontakt: \" & RefStr!H27)","v":"Telefon za kontakt: 031496682"}]
[{"$f":"IF(RefStr!H33=\"\",\"Odgovorna osoba: _____________________________\",\"Odgovorna osoba: \" & RefStr!H33)","v":"Odgovorna osoba: JOSIP JUKIĆ"}]

{"sheet":"Bil","index":4,"n_rows":327,"n_cols":6,"rows_kept":327,"cut":false,"hidden":false,"merged":[[4,1,4,3],[4,4,4,5],[323,3,323,4],[5,1,5,5],[6,1,6,5],[256,0,256,1],[2,0,2,3],[0,0,0,1],[0,2,0,5],[1,4,1,5],[1,0,1,3],[3,1,3,3],[3,4,3,5]]}
["<–––– Povratak na RefStr",null,"Kontrole Bilanca ––––>"]
["BILANCA",null,null,null,"Obrazac BIL\nVP 152"]
[{"$f":"\"na dan \"&IF(RefStr!K10=\"\",\"________________\",TEXT(RefStr!K12,\"d.mmmm yyyy.\"))","v":"na dan 31.prosinac 2017."}]
["Obveznik:",{"$f":"\"RKP: \"&IF(RefStr!B6<>\"\",TEXT(INT(VALUE(RefStr!B6)),\"00000\"),\"_____\"&\",  \"&\"MB: \"&IF(RefStr!B8<>\"\",TEXT(INT(VALUE(RefStr!B8)),\"00000000\"),\"________\")&\"  OIB: \"&IF(RefStr!K14<>\"\",RefStr!K14,\"___________\"))","v":"RKP: 09431"},null,null,{"$f":"SUM(Skriveni!G977:G1286)","v":3550769.5920000002}]
[null,{"$f":"\"Naziv: \"&IF(RefStr!B10<>\"\",RefStr!B10,\"_______________________________________\")","v":"Naziv: OŠ MLADOST OSIJEK"},null,null,"Kontrolni broj obrasca"]
[null,{"$f":" \"Razina: \" & RefStr!B16 & \", Razdjel: \" & TEXT(INT(VALUE(RefStr!B20)), \"000\")","v":"Razina: 31, Razdjel: 000"}]
[null,{"$f":"\"Djelatnost: \" & RefStr!B18 & \" \" & RefStr!C18","v":"Djelatnost: 8520 Osnovno obrazovanje"}]
[]
[null,null,null,null,null,"iznosi u kunama, bez lipa"]
["Račun iz rač. plana","Opis stavke","AOP","Stanje 1. siječnja","Stanje 31. prosinca","Indeks\n(5/4)"]
[1,2,3,4,5,6]
[null,"IMOVINA (AOP 002+063)",1,{"$f":"D13+D74","v":834117},{"$f":"E13+E74","v":877835},{"$f":"IF(D12>0,IF(E12/D12>=100,\">>100\",E12/D12*100),\"-\")","v":105.24123114623008}]
[0,"Nefinancijska imovina (AOP 003+007+046+047+051+058)",2,{"$f":"D14+D18+D57+D58+D62+D69","v":127017},{"$f":"E14+E18+E57+E58+E62+E69","v":157138},123.71414849980711]
["01","Neproizvedena dugotrajna imovina (AOP 004+005-006)",3,{"$f":"D15+D16-D17","v":0},{"$f":"E15+E16-E17","v":0},"-"]
["011","Materijalna imovina - prirodna bogatstva",4,null,null,"-"]
["012","Nematerijalna imovina ",5,null,null,"-"]
["019","Ispravak vrijednosti neproizvedene dugotrajne imovine",6,null,null,"-"]
["02","Proizvedena dugotrajna imovina (AOP 008+014+024+030+036+040)",7,{"$f":"D19+D25+D35+D41+D47+D51","v":127017},{"$f":"E19+E25+E35+E41+E47+E51","v":157138},123.71414849980711]
["021 i 02921","Građevinski objekti (AOP 009 do 012 - 013)",8,{"$f":"SUM(D20:D23)-D24","v":0},{"$f":"SUM(E20:E23)-E24","v":0},"-"]
["0211","Stambeni objekti",9,null,null,"-"]
["0212","Poslovni objekti",10,null,null,"-"]
["0213","Ceste, željeznice i ostali prometni objekti",11,null,null,"-"]
["0214","Ostali građevinski objekti",12,null,null,"-"]
["02921","Ispravak vrijednosti građevinskih objekata",13,null,null,"-"]
["022 i 02922","Postrojenja i oprema (AOP 015 do 022 - 023)",14,{"$f":"SUM(D26:D33)-D34","v":111906},{"$f":"SUM(E26:E33)-E34","v":142223},127.09148749843619]
["0221","Uredska oprema i namještaj",15,1087640,1115357,102.54836159023206]
["0222","Komunikacijska oprema",16,105994,103295,97.453629450723625]
["0223","Oprema za održavanje i zaštitu",17,104960,118519,112.91825457317073]
["0224","Medicinska i laboratorijska oprema",18,null,null,"-"]
["0225","Instrumenti, uređaji i strojevi",19,null,null,"-"]
["0226","Sportska i glazbena oprema",20,114373,117762,102.96311192326861]
["0227","Uređaji, strojevi i oprema za ostale namjene",21,299916,324393,108.16128515984475]
["0228","Vojna oprema",22,null,null,"-"]
["02922","Ispravak vrijednosti postrojenja i opreme",23,1600977,1637103,102.25649712644216]
["023 i 02923","Prijevozna sredstva (AOP 025 do 028 - 029)",24,{"$f":"SUM(D36:D39)-D40","v":0},{"$f":"SUM(E36:E39)-E40","v":0},"-"]
["0231","Prijevozna sredstva u cestovnom prometu",25,null,null,"-"]
["0232","Prijevozna sredstva u željezničkom prometu ",26,null,null,"-"]
["0233","Prijevozna sredstva u pomorskom i riječnom prometu",27,null,null,"-"]
["0234","Prijevozna sredstva u zračnom prometu",28,null,null,"-"]
["02923","Ispravak vrijednosti prijevoznih sredstava ",29,null,null,"-"]
["024 i 02924","Knjige, umjetnička djela i ostale izložbene vrijednosti (AOP 031 do 034 - 035)",30,{"$f":"SUM(D42:D45)-D46","v":13647},{"$f":"SUM(E42:E45)-E46","v":13451},98.563786912874633]
["0241","Knjige ",31,298015,298015,100]
["0242","Umjetnička djela (izložena u galerijama, muzejima i slično)",32,null,null,"-"]
["0243","Muzejski izlošci i predmeti prirodnih rijetkosti",33,null,null,"-"]
["0244","Ostale nespomenute izložbene vrijednosti",34,null,null,"-"]
["02924","Ispravak vrijednosti knjiga, umjetničkih djela i ostalih izložbenih vrijednosti",35,284368,284564,100.06892477353288]
["025 i 02925","Višegodišnji nasadi i osnovno stado (AOP 037+038-039)",36,{"$f":"SUM(D48:D49)-D50","v":0},{"$f":"SUM(E48:E49)-E50","v":0},"-"]
["0251","Višegodišnji nasadi",37,null,null,"-"]
["0252","Osnovno stado",38,null,null,"-"]
["02925","Ispravak vrijednosti višegodišnjih nasada i osnovnog stada",39,null,null,"-"]
["026 i 02926","Nematerijalna proizvedena imovina (AOP 041 do 044 - 045)",40,{"$f":"SUM(D52:D55)-D56","v":1464},{"$f":"SUM(E52:E55)-E56","v":1464},100]
["0261","Istraživanje rudnih bogatstava",41,null,null,"-"]
["0262","Ulaganja u računalne programe",42,1464,1464,100]
["0263","Umjetnička, literarna i znanstvena djela",43,null,null,"-"]
["0264","Ostala nematerijalna proizvedena imovina",44,null,null,"-"]
["02926","Ispravak vrijednosti nematerijalne proizvedene imovine",45,null,null,"-"]
["03","Plemeniti metali i ostale pohranjene vrijednosti",46,null,null,"-"]
["04","Sitni inventar (AOP 048+049-050)",47,{"$f":"SUM(D59:D60)-D61","v":0},{"$f":"SUM(E59:E60)-E61","v":0},"-"]
["041","Zalihe sitnog inventara",48,null,null,"-"]
["042","Sitni inventar u upotrebi",49,185752,181014,97.449287221671909]
["049","Ispravak vrijednosti sitnog inventara",50,185752,181014,97.449287221671909]
["05","Dugotrajna nefinancijska imovina u pripremi (AOP 052 do 057)",51,{"$f":"SUM(D63:D68)","v":0},{"$f":"SUM(E63:E68)","v":0},"-"]
["051","Građevinski objekti u pripremi",52,null,null,"-"]
["052","Postrojenja i oprema u pripremi",53,null,null,"-"]
["053","Prijevozna sredstva u pripremi",54,null,null,"-"]
["054","Višegodišnji nasadi i osnovno stado u pripremi",55,null,null,"-"]
["055","Ostala nematerijalna proizvedena imovina u pripremi",56,null,null,"-"]
["056","Ostala nefinancijska dugotrajna imovina u pripremi",57,null,null,"-"]
["06","Proizvedena kratkotrajna imovina (AOP 059 do 062)",58,{"$f":"SUM(D70:D73)","v":0},{"$f":"SUM(E70:E73)","v":0},"-"]
["061","Zalihe za obavljanje djelatnosti",59,null,null,"-"]
["062","Proizvodnja i proizvodi",60,null,null,"-"]
["063","Zalihe vojnih sredstava za jednokratnu upotrebu",61,null,null,"-"]
["064","Roba za daljnju prodaju",62,null,null,"-"]
["1","Financijska imovina (AOP 064+073+081+112+128+140+157+158)",63,{"$f":"D75+D84+D92+D123+D139+D151+D168+D169","v":707100},{"$f":"E75+E84+E92+E123+E139+E151+E168+E169","v":720697},101.92292462169424]
["11","Novac u banci i blagajni (AOP 065+070 do 072)",64,{"$f":"+D76+D81+D82+D83","v":205268},{"$f":"+E76+E81+E82+E83","v":127487},62.107586180018316]
["111","Novac u banci (AOP 066 do 069)",65,{"$f":"SUM(D77:D80)","v":204905},{"$f":"SUM(E77:E80)","v":126366},{"$f":"IF(D76>0,IF(E76/D76>=100,\">>100\",E76/D76*100),\"-\")","v":61.670530245723633}]
["1111","Novac na računu kod Hrvatske narodne banke",66,null,null,"-"]
["1112","Novac na računu kod tuzemnih poslovnih banaka",67,204905,126366,61.670530245723633]
["1113","Novac na računu kod inozemnih poslovnih banaka",68,null,null,"-"]
["1114","Prijelazni račun",69,0,0,"-"]
["112","Izdvojena novčana sredstva ",70,null,null,"-"]
["113","Novac u blagajni",71,363,1121,308.8154269972452]
["114","Vrijednosnice u blagajni",72,null,null,"-"]
["12","Depoziti, jamčevni polozi i potraživanja od zaposlenih te za više plaćene poreze i ostalo (AOP 074 + 077 do 080)",73,{"$f":"+D85+SUM(D88:D91)","v":1540},{"$f":"+E85+SUM(E88:E91)","v":22766},1478.3116883116882]
["121","Depoziti u kreditnim i ostalim financijskim institucijama (AOP 075+076)",74,{"$f":"SUM(D86:D87)","v":0},{"$f":"SUM(E86:E87)","v":0},"-"]
["1211","Depoziti u tuzemnim kreditnim i ostalim financijskim institucijama",75,null,null,"-"]
["1212","Depoziti u inozemnim kreditnim i ostalim financijskim institucijama",76,null,null,"-"]
["122","Jamčevni polozi",77,null,null,"-"]
["123","Potraživanja od zaposlenih",78,0,0,"-"]
["124","Potraživanja za više plaćene poreze i doprinose",79,null,null,"-"]
["129","Ostala potraživanja",80,1540,22766,1478.3116883116882]
["13","Potraživanja za dane zajmove (AOP 082+100-111)",81,{"$f":"D93+D111-D122","v":0},{"$f":"E93+E111-E122","v":0},"-"]
[null,"Zajmovi - tuzemni (AOP 083 do 099)",82,{"$f":"SUM(D94:D110)","v":0},{"$f":"SUM(E94:E110)","v":0},"-"]
["1321","Zajmovi neprofitnim organizacijama, građanima i kućanstvima u tuzemstvu",83,null,null,"-"]
["1332","Zajmovi kreditnim institucijama u javnom sektoru",84,null,null,"-"]
["1333","Zajmovi osiguravajućim društvima u javnom sektoru",85,null,null,"-"]
["1334","Zajmovi ostalim financijskim institucijama u javnom sektoru",86,null,null,"-"]
["1341","Zajmovi trgovačkim društvima u javnom sektoru",87,null,null,"-"]
["1353","Zajmovi tuzemnim kreditnim institucijama izvan javnog sektora",88,null,null,"-"]
["1354","Zajmovi tuzemnim osiguravajućim društvima izvan javnog sektora",89,null,null,"-"]
["1355","Zajmovi ostalim tuzemnim financijskim institucijama izvan javnog sektora",90,null,null,"-"]
["1363","Zajmovi tuzemnim trgovačkim društvima izvan javnog sektora",91,null,null,"-"]
["1364","Zajmovi tuzemnim obrtnicima",92,null,null,"-"]
["1371","Zajmovi državnom proračunu",93,null,null,"-"]
["1372","Zajmovi županijskim proračunima",94,null,null,"-"]
["1373","Zajmovi gradskim proračunima",95,null,null,"-"]
["1374","Zajmovi općinskim proračunima",96,null,null,"-"]
["1375","Zajmovi HZMO-u, HZZ-u, HZZO-u",97,null,null,"-"]
["1376","Zajmovi ostalim izvanproračunskim korisnicima državnog proračuna",98,null,null,"-"]
["1377","Zajmovi izvanproračunskim korisnicima županijskih, gradskih i općinskih proračuna",99,null,null,"-"]
[null,"Zajmovi - inozemni (AOP 101 do 110)",100,{"$f":"SUM(D112:D121)","v":0},{"$f":"SUM(E112:E121)","v":0},"-"]
["1313","Zajmovi međunarodnim organizacijama ",101,null,null,"-"]
["1314","Zajmovi institucijama i tijelima EU",102,null,null,"-"]
["1315","Zajmovi inozemnim vladama u EU",103,null,null,"-"]
["1316","Zajmovi inozemnim vladama izvan EU",104,null,null,"-"]
["1322","Zajmovi neprofitnim organizacijama, građanima i kućanstvima u inozemstvu",105,null,null,"-"]
["1356","Zajmovi inozemnim kreditnim institucijama",106,null,null,"-"]
["1357","Zajmovi inozemnim osiguravajućim društvima",107,null,null,"-"]
["1358","Zajmovi ostalim inozemnim financijskim institucijama",108,null,null,"-"]
["1365","Zajmovi inozemnim trgovačkim društvima",109,null,null,"-"]
["1366","Zajmovi inozemnim obrtnicima",110,null,null,"-"]
["139","Ispravak vrijednosti danih zajmova",111,null,null,"-"]
["14","Vrijednosni papiri (AOP 113+120-127)",112,{"$f":"D124+D131-D138","v":0},{"$f":"E124+E131-E138","v":0},"-"]
[null,"Vrijednosni papiri - tuzemni (AOP 114 do 119)",113,{"$f":"SUM(D125:D130)","v":0},{"$f":"SUM(E125:E130)","v":0},"-"]
["1411","Čekovi",114,null,null,"-"]
["1421","Komercijalni i blagajnički zapisi",115,null,null,"-"]
["1431","Mjenice",116,null,null,"-"]
["1441","Obveznice",117,null,null,"-"]
["1451","Opcije i drugi financijski derivati",118,null,null,"-"]
["1461","Ostali vrijednosni papiri",119,null,null,"-"]
[null,"Vrijednosni papiri - inozemni (AOP 121 do 126)",120,{"$f":"SUM(D132:D137)","v":0},{"$f":"SUM(E132:E137)","v":0},"-"]
["1412","Čekovi",121,null,null,"-"]
["1422","Komercijalni i blagajnički zapisi",122,null,null,"-"]
["1432","Mjenice",123,null,null,"-"]
["1442","Obveznice",124,null,null,"-"]
["1452","Opcije i drugi financijski derivati",125,null,null,"-"]
["1462","Ostali vrijednosni papiri",126,null,null,"-"]
["149","Ispravak vrijednosti vrijednosnih papira",127,null,null,"-"]
["15","Dionice i udjeli u glavnici (AOP 129+136-139)",128,{"$f":"D140+D147-D150","v":0},{"$f":"E140+E147-E150","v":0},"-"]
[null,"Dionice i udjeli u glavnici - tuzemni (AOP 130 do 135)",129,{"$f":"SUM(D141:D146)","v":0},{"$f":"SUM(E141:E146)","v":0},{"$f":"IF(D140>0,IF(E140/D140>=100,\">>100\",E140/D140*100),\"-\")","v":"-"}]
["1512","Dionice i udjeli u glavnici kreditnih institucija u javnom sektoru",130,null,null,"-"]
["1513","Dionice i udjeli u glavnici osiguravajućih društava u javnom sektoru",131,null,null,"-"]
["1514","Dionice i udjeli u glavnici ostalih financijskih institucija u javnom sektoru",132,null,null,"-"]
["1521","Dionice i udjeli u glavnici trgovačkih društava u javnom sektoru",133,null,null,"-"]
["1531","Dionice i udjeli u glavnici tuzemnih kreditnih i ostalih financijskih institucija izvan javnog sektora",134,null,null,"-"]
["1541","Dionice i udjeli u glavnici tuzemnih trgovačkih društava izvan javnog sektora",135,null,null,"-"]
[null,"Dionice i udjeli u glavnici - inozemni (AOP 137+138)",136,{"$f":"SUM(D148:D149)","v":0},{"$f":"SUM(E148:E149)","v":0},"-"]
["1532","Dionice i udjeli u glavnici inozemnih kreditnih i ostalih financijskih institucija",137,null,null,"-"]
["1542","Dionice i udjeli u glavnici inozemnih trgovačkih društava",138,null,null,"-"]
["159","Ispravak vrijednosti dionica i udjela u glavnici",139,null,null,"-"]
["16","Potraživanja za prihode poslovanja (AOP 141+142+143+151+152+153+154+155-156)",140,{"$f":"SUM(D152:D154)+SUM(D162:D166)-D167","v":7258},{"$f":"SUM(E152:E154)+SUM(E162:E166)-E167","v":8943},123.2157619178837]
["161","Potraživanja za poreze",141,null,null,"-"]
["162","Potraživanja za doprinose",142,null,null,"-"]
["163","Potraživanja za pomoći iz inozemstva i od subjekata unutar općeg proračuna (AOP 144 do 150)",143,{"$f":"SUM(D155:D161)","v":0},{"$f":"SUM(E155:E161)","v":0},"-"]
["1631","Potraživanja za pomoći od inozemnih vlada",144,null,null,"-"]
["1632","Potraživanja za pomoći od međunarodnih organizacija te institucija i tijela EU",145,null,null,"-"]
["1633","Potraživanja za pomoći proračunu iz drugih proračuna",146,null,null,"-"]
["1634","Potraživanja za pomoći od izvanproračunskih korisnika",147,null,null,"-"]
["1635","Pomoći izravnanja za decentralizirane funkcije",148,null,null,"-"]
["1636","Potraživanja za pomoći proračunskim korisnicima iz proračuna koji im nije nadležan",149,null,null,"-"]
["1638","Potraživanja za pomoći iz državnog proračuna temeljem prijenosa EU sredstava",150,null,null,"-"]
["164","Potraživanja za prihode od imovine",151,null,null,"-"]
["165","Potraživanja za upravne i administrativne pristojbe, pristojbe po posebnim propisima i naknade",152,null,null,"-"]
["166","Potraživanja za prihode od prodaje proizvoda i robe te pruženih usluga",153,7258,8943,123.2157619178837]
["167","Potraživanja za prihode iz proračuna",154,null,null,"-"]
["168","Potraživanja za kazne i upravne mjere te ostale prihode",155,null,null,"-"]
["169","Ispravak vrijednosti potraživanja",156,null,null,"-"]
["17","Potraživanja od prodaje nefinancijske imovine",157,null,null,"-"]
["19","Rashodi budućih razdoblja i nedospjela naplata prihoda (AOP 159 do 161)",158,{"$f":"SUM(D170:D172)","v":493034},{"$f":"SUM(E170:E172)","v":561501},113.88687189930107]
["191","Unaprijed plaćeni rashodi budućih razdoblja",159,null,null,"-"]
["192","Nedospjela naplata prihoda",160,null,null,"-"]
["193","Kontinuirani rashodi budućih razdoblja",161,493034,561501,113.88687189930107]
[null,"OBVEZE I VLASTITI IZVORI (AOP 163+223)",162,{"$f":"D174+D234","v":834116},{"$f":"E174+E234","v":877834},105.24123742980593]
["2","Obveze (AOP 164+175+176+192+220) ",163,{"$f":"D175+D186+D187+D203+D231","v":613897},{"$f":"E175+E186+E187+E203+E231","v":699199},113.89516482406658]
["23","Obveze za rashode poslovanja (AOP 165 do 167 + 171 do 174)",164,{"$f":"SUM(D176:D178)+SUM(D182:D185)","v":597788},{"$f":"SUM(E176:E178)+SUM(E182:E185)","v":691521},115.67997350231185]
["231","Obveze za zaposlene",165,484295,558273,115.27540032418257]
["232","Obveze za materijalne rashode",166,111158,118222,106.35491822450926]
["234","Obveze za financijske rashode (AOP 168 do 170)",167,{"$f":"SUM(D179:D181)","v":795},{"$f":"SUM(E179:E181)","v":125},15.723270440251572]
["2341","Obveze za kamate za izdane vrijednosne papire",168,null,null,"-"]
["2342","Obveze za kamate na primljene kredite i zajmove",169,null,null,"-"]
["2343","Obveze za ostale financijske rashode",170,795,125,15.723270440251572]
["235","Obveze za subvencije",171,null,null,"-"]
["237","Obveze za naknade građanima i kućanstvima",172,null,null,"-"]
["238","Obveze za kazne, naknade šteta i kapitalne pomoći",173,null,null,"-"]
["239","Ostale tekuće obveze",174,1540,14901,967.59740259740261]
["24","Obveze za nabavu nefinancijske imovine",175,0,0,"-"]
["25","Obveze za vrijednosne papire (AOP 177+184-191)",176,{"$f":"D188+D195-D202","v":0},{"$f":"E188+E195-E202","v":0},"-"]
[null,"Obveze za vrijednosne papire - tuzemne (AOP 178 do 183)",177,{"$f":"SUM(D189:D194)","v":0},{"$f":"SUM(E189:E194)","v":0},"-"]
["2511","Obveze za čekove",178,null,null,"-"]
["2521","Obveze za trezorske zapise",179,null,null,"-"]
["2531","Obveze za mjenice",180,null,null,"-"]
["2541","Obveze za obveznice",181,null,null,"-"]
["2551","Obveze za opcije i druge financijske derivate",182,null,null,"-"]
["2561","Obveze za ostale vrijednosne papire",183,null,null,"-"]
[null,"Obveze za vrijednosne papire - inozemne (AOP 185 do 190)",184,{"$f":"SUM(D196:D201)","v":0},{"$f":"SUM(E196:E201)","v":0},"-"]
["2512","Obveze za čekove",185,null,null,"-"]
["2522","Obveze za trezorske zapise",186,null,null,"-"]
["2532","Obveze za mjenice",187,null,null,"-"]
["2542","Obveze za obveznice",188,null,null,"-"]
["2552","Obveze za opcije i druge financijske derivate",189,null,null,"-"]
["2562","Obveze za ostale vrijednosne papire",190,null,null,"-"]
["259","Ispravak vrijednosti obveza za vrijednosne papire",191,null,null,"-"]
["26","Obveze za kredite i zajmove (AOP 193+210)",192,{"$f":"D204+D221","v":0},{"$f":"E204+E221","v":0},"-"]
[null,"Obveze za kredite i zajmove - tuzemne (AOP 194 do 209)",193,{"$f":"SUM(D205:D220)","v":0},{"$f":"SUM(E205:E220)","v":0},{"$f":"IF(D204>0,IF(E204/D204>=100,\">>100\",E204/D204*100),\"-\")","v":"-"}]
["2622","Obveze za kredite od kreditnih institucija u javnom sektoru",194,null,null,"-"]
["2623","Obveze za zajmove od osiguravajućih društava u javnom sektoru",195,null,null,"-"]
["2624","Obveze za zajmove od ostalih financijskih institucija u javnom sektoru",196,null,null,"-"]
["2631","Obveze za zajmove od trgovačkih društava u javnom sektoru",197,null,null,"-"]
["2643","Obvez za kredite od tuzemnih kreditnih institucija izvan javnog sektora",198,null,null,"-"]
["2644","Obveze za zajmove od tuzemnih osiguravajućih društava izvan javnog sektora",199,null,null,"-"]
["2645","Obveze za zajmove od ostalih tuzemnih financijskih institucija izvan javnog sektora",200,null,null,"-"]
["2653","Obveze za zajmove od tuzemnih trgovačkih društava izvan javnog sektora",201,null,null,"-"]
["2654","Obveze za zajmove od tuzemnih obrtnika",202,null,null,"-"]
["2671","Obveze za zajmove od državnog proračuna",203,null,null,"-"]
["2672","Obveze za zajmove od županijskih proračuna",204,null,null,"-"]
["2673","Obveze za zajmove od gradskih proračuna",205,null,null,"-"]
["2674","Obveze za zajmove od općinskih proračuna",206,null,null,"-"]
["2675","Obveze za zajmove od HZMO-a, HZZ-a i HZZO-a",207,null,null,"-"]
["2676","Obveze za zajmove od ostalih izvanproračunskih korisnika državnog proračuna",208,null,null,"-"]
["2677","Obveze za zajmove od izvanproračunskih korisnika županijskih, gradskih i općinskih proračuna",209,null,null,"-"]
[null,"Obveze za kredite i zajmove - inozemne (AOP 211 do 219)",210,{"$f":"SUM(D222:D230)","v":0},{"$f":"SUM(E222:E230)","v":0},"-"]
["2613","Obveze za zajmove od međunarodnih organizacija",211,null,null,"-"]
["2614","Obveze za kredite i zajmove od institucija i tijela EU",212,null,null,"-"]
[2615,"Obveze za zajmove od inozemnih vlada u EU",213,null,null,"-"]
[2616,"Obveze za zajmove od inozemnih vlada izvan EU",214,null,null,"-"]
[2646,"Obveze za kredite od inozemnih kreditnih institucija",215,null,null,"-"]
[2647,"Obveze za zajmove od inozemnih osiguravajućih društava",216,null,null,"-"]
[2648,"Obveze za zajmove od ostalih inozemnih financijskih institucija",217,null,null,"-"]
[2655,"Obveze za zajmove od inozemnih trgovačkih društava",218,null,null,"-"]
[2656,"Obveze za zajmove od inozemnih obrtnika",219,null,null,"-"]
["29","Odgođeno plaćanje rashoda i prihodi budućih razdoblja (AOP 221+222)",220,{"$f":"SUM(D232:D233)","v":16109},{"$f":"SUM(E232:E233)","v":7678},47.662797194115093]
["291","Odgođeno plaćanje rashoda",221,0,0,"-"]
["292","Naplaćeni prihodi budućih razdoblja",222,16109,7678,47.662797194115093]
["9","Vlastiti izvori (224 + 232 - 236 + 240 do 242)",223,{"$f":"+D235+D243-D247+D251+D252+D253","v":220219},{"$f":"+E235+E243-E247+E251+E252+E253","v":178635},81.116979007260966]
["91","Vlastiti izvori i ispravak vlastitih izvora (AOP 225-228)",224,{"$f":"D236-D239","v":127017},{"$f":"E236-E239","v":157142},123.7172976845619]
["911","Vlastiti izvori (AOP 226+227)",225,{"$f":"SUM(D237:D238)","v":127017},{"$f":"SUM(E237:E238)","v":157142},123.7172976845619]
["9111","Vlastiti izvori iz proračuna",226,127017,157142,123.7172976845619]
["9112","Ostali vlastiti izvori",227,null,null,"-"]
["912","Ispravak vlastitih izvora za obveze (AOP 229+230)",228,{"$f":"SUM(D240:D241)","v":0},{"$f":"SUM(E240:E241)","v":0},"-"]
["9121","Ispravak vlastitih izvora iz proračuna za obveze",229,null,null,"-"]
["9122","Ispravak ostalih vlastitih izvora za obveze",230,null,null,"-"]
["922","Višak/manjak prihoda (ne upisuje se podatak)",231,null,null,"-"]
["9221","Višak prihoda (AOP 233 do 235)",232,{"$f":"SUM(D244:D246)","v":85944},{"$f":"SUM(E244:E246)","v":12550},14.602531881224984]
["92211","Višak prihoda poslovanja",233,85944,12550,14.602531881224984]
["92212","Višak prihoda od nefinancijske imovine",234,null,null,"-"]
["92213","Višak primitaka od financijske imovine",235,null,null,"-"]
["9222","Manjak prihoda (AOP 237 do 239)",236,{"$f":"SUM(D248:D250)","v":0},{"$f":"SUM(E248:E250)","v":0},"-"]
["92221","Manjak prihoda poslovanja",237,null,null,"-"]
["92222","Manjak prihoda od nefinancijske imovine",238,null,null,"-"]
["92223","Manjak primitaka od financijske imovine",239,null,null,"-"]
["96","Obračunati prihodi poslovanja",240,7258,8943,123.2157619178837]
["97","Obračunati prihodi od prodaje nefinancijske imovine",241,null,null,"-"]
["98","Rezerviranja viška prihoda",242,null,null,"-"]
["99","Izvanbilančni zapisi (= 0)",243,{"$f":"+D255-D256","v":0},{"$f":"+E255-E256","v":0},"-"]
["991","Izvanbilančni zapisi - aktiva (AOP 245)",244,{"$f":"D256","v":0},{"$f":"E256","v":0},"-"]
["996","Izvanbilančni zapisi - pasiva",245,null,null,"-"]
["Obvezni analitički podaci"]
["dio 13","Potraživanja za dane zajmove - dospjela",246,null,null,{"$f":"IF(D258>0,IF(E258/D258>=100,\">>100\",E258/D258*100),\"-\")","v":"-"}]
["dio 13","Potraživanja za dane zajmove - nedospjela",247,null,null,"-"]
["dio 16","Potraživanja za prihode poslovanja - dospjela",248,null,null,"-"]
["dio 16","Potraživanja za prihode poslovanja - nedospjela",249,7258,8943,123.2157619178837]
["dio 17","Potraživanja od prodaje nefinancijske imovine - dospjela",250,null,null,"-"]
["dio 17","Potraživanja od prodaje nefinancijske imovine - nedospjela",251,null,null,"-"]
["12911","Potraživanja za naknade koje se refundiraju",252,null,23227]
["12912","Potraživanja za predujmove",253]
["12913","Potraživanja za dane predujmove za EU projekte",254]
["12921","Ostala nespomenuta potraživanja",255,0,125]
["12931","Potraživanja za prodana potraživanja (faktoring)",256]
["12941","Potraživanja proračuna od proračunskih korisnika za povrat u nadležni proračun",257]
["13213","Zajmovi neprofitnim organizacijama, građanima i kućanstvima u tuzemstvu po protestiranim jamstvima",258,null,null,"-"]
["13323","Zajmovi kreditnim institucijama u javnom sektoru po protestiranim jamstvima",259,null,null,"-"]
["13333","Zajmovi  osiguravajućim društvima u javnom sektoru po protestiranim jamstvima",260]
["13343","Zajmovi ostalim financijskim institucijama u javnom sektoru po protestiranim jamstvima",261]
["13413","Zajmovi trgovačkim društvima u javnom sektoru po protestiranim jamstvima",262]
["13533","Zajmovi tuzemnim kreditnim institucijama izvan javnog sektora po protestiranim jamstvima",263]
["13543","Zajmovi tuzemnim osiguravajućim društvima izvan javnog sektora po protestiranim jamstvima",264]
["13553","Zajmovi ostalim tuzemnim financijskim institucijama izvan javnog sektora po protestiranim jamstvima",265]
["13633","Zajmovi tuzemnim trgovačkim društvima izvan javnog sektora po protestiranim jamstvima",266]
["13643","Zajmovi  tuzemnim obrtnicima po protestiranim jamstvima",267]
["13723","Zajmovi županijskim proračunima po protestiranim jamstvima",268]
["13733","Zajmovi gradskim proračunima po protestiranim jamstvima",269]
["13743","Zajmovi općinskim proračunima po protestiranim jamstvima",270]
["13753","Zajmovi  HZMO-u, HZZ-u i HZZO-u po protestiranim jamstvima",271]
["13763","Zajmovi ostalim izvanproračunskim korisnicima državnog proračuna po protestiranim jamstvima",272]
["13773","Zajmovi izvanproračunskim korisnicima županijskih, gradskih i općinskih proračuna po protestiranim jamstvima",273]
["16721","Potraživanja za prihode proračunskih korisnika uplaćene u proračun",274]
["dio 23","Obveze za rashode poslovanja - dospjele",275,597788,691521,115.67997350231185]
["dio 23","Obveze za rashode poslovanja - nedospjele",276,null,null,"-"]
["dio 24","Obveze za nabavu nefinancijske imovine - dospjele",277,null,null,"-"]
["dio 24","Obveze za nabavu nefinancijske imovine - nedospjele",278,null,null,"-"]
["dio 25","Obveze za vrijednosne papire - dospjele",279,null,null,"-"]
["dio 25","Obveze za vrijednosne papire - nedospjele",280,null,null,"-"]
["dio 26","Obveze za kredite i zajmove - dospjele",281,null,null,"-"]
["dio 26","Obveze za kredite i zajmove - nedospjele",282,null,null,"-"]
["23951","Obveze za predujmove",283,null,null,"-"]
["23952","Obveze za depozite",284]
["23953","Obveze za jamčevine",285]
[23954,"Ostale nespomenute obveze",286]
[23955,"Obveze za naplaćene tuđe prihode ",287]
[23956,"Obveze proračuna za naplaćene prihode proračunskog korisnika",288]
[23957,"Obveze za EU predujmove",289]
[23958,"Obveze proračunskih korisnika za povrat u proračun",290,1540,14901]
["26223","Obveze za financijski leasing od kreditnih institucija u javnom sektoru",291,null,null,"-"]
[26224,"Obveze za zajmove po faktoringu od kreditnih institucija u javnom sektoru",292,null,null,"-"]
[26233,"Obveze za zajmove po faktoringu od osiguravajućih društava u javnom sektoru",293,null,null,"-"]
["26243","Obveze za financijski leasing od ostalih financijskih institucija u javnom sektoru",294,null,null,"-"]
[26244,"Obveze za zajmove po faktoringu od ostalih financijskih institucija u javnom sektoru",295,null,null,"-"]
[26314,"Obveze za zajmove po faktoringu od trgovačkih društava u javnom sektoru",296,null,null,"-"]
["26433","Obveze za financijski leasing od tuzemnih kreditnih institucija izvan javnog sektora",297,null,null,"-"]
[26434,"Obveze za zajmove po faktoringu od tuzemnih kreditnih institucija izvan javnog sektora",298,null,null,"-"]
[26443,"Obveze za zajmove po faktoringu od tuzemnih osiguravajućih društava izvan javnog sektora",299,null,null,"-"]
["26453","Obveze za financijski leasing od ostalih tuzemnih financijskih institucija izvan javnog sektora",300,null,null,"-"]
[26454,"Obveze za zajmove po faktoringu od ostalih tuzemnih financijskih institucija izvan javnog sektora",301,null,null,"-"]
["26463","Obveze za financijski leasing od inozemnih kreditnih institucija",302,null,null,"-"]
[26464,"Obveze za zajmove po faktoringu od inozemnih kreditnih institucija",303,null,null,"-"]
[26473,"Obveze za zajmove po faktoringu od inozemnih osiguravajućih društava",304,null,null,"-"]
["26483","Obveze za financijski leasing od ostalih inozemnih financijskih institucija",305,null,null,"-"]
[26484,"Obveze za zajmove po faktoringu od ostalih inozemnih financijskih institucija",306,null,null,"-"]
[26534,"Obveze za zajmove po faktoringu od tuzemnih trgovačkih društava izvan javnog sektora",307,null,null,"-"]
[26544,"Obveze za zajmove po faktoringu od tuzemnih obrtnika",308,null,null,"-"]
[26554,"Obveze za zajmove po faktoringu od inozemnih trgovačkih društava",309,null,null,"-"]
[26564,"Obveze za zajmove po faktoringu od inozemnih obrtnika",310,null,null,{"$f":"IF(D322>0,IF(E322/D322>=100,\">>100\",E322/D322*100),\"-\")","v":"-"}]
[]
["U _________________________________________, dana: ____.____.________.",null,null,"Odgoovorna osoba (potpis)"]
[{"$f":"IF(RefStr!H25<>\"\", \"Osoba za kontaktiranje: \" & RefStr!H25,\"Osoba za kontaktiranje: _________________________________________\")","v":"Osoba za kontaktiranje: Robertina Filić"}]
[{"$f":"IF(RefStr!H27=\"\",\"Telefon za kontakt: _________________\",\"Telefon za kontakt: \" & RefStr!H27)","v":"Telefon za kontakt: 031496682"}]
[{"$f":"IF(RefStr!H33=\"\",\"Odgovorna osoba: _____________________________\",\"Odgovorna osoba: \" & RefStr!H33)","v":"Odgovorna osoba: JOSIP JUKIĆ"}]

{"sheet":"RasF","index":5,"n_rows":153,"n_cols":6,"rows_kept":153,"cut":false,"hidden":false,"merged":[[3,1,3,3],[3,4,3,5],[4,1,4,3],[4,4,4,5],[149,3,149,4],[1,4,1,5],[1,0,1,3],[0,0,0,1],[0,2,0,5],[5,1,5,5],[6,1,6,5],[2,0,2,3]]}
["<–––– Povratak na RefStr",null,"Kontrole RAS-funkcijski"]
["IZVJEŠTAJ O RASHODIMA PREMA FUNKCIJSKOJ KLASIFIKACIJI",null,null,null,"Obrazac RAS-funkcijski\nVP 154"]
[{"$f":"\"za razdoblje \"&IF(RefStr!K10=\"\",\"________________\",TEXT(RefStr!K10,\"d.mmmm yyyy.\")&\" do \"&IF(RefStr!K12=\"\",\"______________\",TEXT(RefStr!K12,\"d. mmmm yyyy.\")))","v":"za razdoblje 1.siječanj 2017. do 31. prosinac 2017."}]
["Obveznik:",{"$f":"\"RKP: \"&IF(RefStr!B6<>\"\",TEXT(INT(VALUE(RefStr!B6)),\"00000\"),\"_____\"&\",  \"&\"MB: \"&IF(RefStr!B8<>\"\",TEXT(INT(VALUE(RefStr!B8)),\"00000000\"),\"________\")&\"  OIB: \"&IF(RefStr!K14<>\"\",RefStr!K14,\"___________\"))","v":"RKP: 09431"},null,null,{"$f":"SUM(Skriveni!G1287:G1423)","v":10764600.587000001}]
[null,{"$f":"\"Naziv: \"&IF(RefStr!B10<>\"\",RefStr!B10,\"_______________________________________\")","v":"Naziv: OŠ MLADOST OSIJEK"},null,null,"Kontrolni broj obrasca"]
[null,{"$f":" \"Razina: \" & RefStr!B16 & \", Razdjel: \" & TEXT(INT(VALUE(RefStr!B20)), \"000\")","v":"Razina: 31, Razdjel: 000"}]
[null,{"$f":"\"Djelatnost: \" & RefStr!B18 & \" \" & RefStr!C18","v":"Djelatnost: 8520 Osnovno obrazovanje"}]
[]
[null,null,null,null,null,"iznosi u kunama, bez lipa"]
["Brojč. ozn. funk. klas.","Opis stavke","AOP","Ostvareno u prethodnoj godini","Ostvareno u tekućoj godini","Indeks\n(5/4)"]
[1,2,3,4,5,6]
["01","Opće javne usluge (AOP 002+006+009+013 do 017)",1,{"$f":"D13+D17+D20+SUM(D24:D28)","v":0},{"$f":"E13+E17+E20+SUM(E24:E28)","v":0},{"$f":"IF(D12>0,IF(E12/D12>=100,\">>100\",E12/D12*100),\"-\")","v":"-"}]
["011","Izvršna i zakonodavna tijela, financijski i fiskalni poslovi, vanjski poslovi (AOP 003 do 005)",2,{"$f":"SUM(D14:D16)","v":0},{"$f":"SUM(E14:E16)","v":0},{"$f":"IF(D13>0,IF(E13/D13>=100,\">>100\",E13/D13*100),\"-\")","v":"-"}]
["0111","Izvršna i zakonodavna tijela",3,null,null,{"$f":"IF(D14>0,IF(E14/D14>=100,\">>100\",E14/D14*100),\"-\")","v":"-"}]
["0112","Financijski i fiskalni poslovi",4,null,null,"-"]
["0113","Vanjski poslovi",5,null,null,"-"]
["012","Inozemna ekonomska pomoć (AOP 007+008)",6,{"$f":"SUM(D18:D19)","v":0},{"$f":"SUM(E18:E19)","v":0},"-"]
["0121","Ekonomska pomoć zemljama u razvoju i zemljama u tranziciji",7,null,null,"-"]
["0122","Ekonomska pomoć usmjerena preko međunarodnih agencija",8,null,null,"-"]
["013","Opće usluge (AOP 010 do 012)",9,{"$f":"SUM(D21:D23)","v":0},{"$f":"SUM(E21:E23)","v":0},"-"]
["0131","Opće usluge vezane za službenike",10,null,null,"-"]
["0132","Sveukupno planiranje i statističke usluge",11,null,null,"-"]
["0133","Ostale opće usluge",12,null,null,"-"]
["014","Osnovna istraživanja",13,null,null,"-"]
["015","Istraživanje i razvoj: Opće javne usluge",14,null,null,"-"]
["016","Opće javne usluge koje nisu drugdje svrstane",15,null,null,"-"]
["017","Transakcije vezane za javni dug",16,null,null,"-"]
["018","Prijenosi općeg karaktera između različitih državnih razina",17,null,null,"-"]
["02","Obrana (AOP 019 do 023)",18,{"$f":"SUM(D30:D34)","v":0},{"$f":"SUM(E30:E34)","v":0},"-"]
["021","Vojna obrana",19,null,null,"-"]
["022","Civilna obrana",20,null,null,"-"]
["023","Inozemna vojna pomoć",21,null,null,"-"]
["024","Istraživanje i razvoj obrane",22,null,null,"-"]
["025","Rashodi za obranu koji nisu drugdje svrstani",23,null,null,"-"]
["03","Javni red i sigurnost (AOP 025 do 030)",24,{"$f":"SUM(D36:D41)","v":0},{"$f":"SUM(E36:E41)","v":0},"-"]
["031","Usluge policije",25,null,null,"-"]
["032","Usluge protupožarne zaštite",26,null,null,"-"]
["033","Sudovi",27,null,null,"-"]
["034","Zatvori",28,null,null,"-"]
["035","Istraživanje i razvoj: Javni red i sigurnost",29,null,null,"-"]
["036","Rashodi za javni red i sigurnost koji nisu drugdje svrstani",30,null,null,"-"]
["04","Ekonomski poslovi (AOP 032+035+039+046+050+056+057+062+070)",31,{"$f":"D43+D46+D50+D57+D61+D67+D68+D73+D81","v":0},{"$f":"E43+E46+E50+E57+E61+E67+E68+E73+E81","v":0},"-"]
["041","Opći ekonomski, trgovački i poslovi vezani uz rad (AOP 033+034) ",32,{"$f":"SUM(D44:D45)","v":0},{"$f":"SUM(E44:E45)","v":0},"-"]
["0411","Opći ekonomski i trgovački poslovi",33,null,null,"-"]
["0412","Opći poslovi vezani uz rad",34,null,null,"-"]
["042","Poljoprivreda, šumarstvo, ribarstvo i lov (AOP 036 do 038)",35,{"$f":"SUM(D47:D49)","v":0},{"$f":"SUM(E47:E49)","v":0},"-"]
["0421","Poljoprivreda",36,null,null,"-"]
["0422","Šumarstvo",37,null,null,"-"]
["0423","Ribarstvo i lov",38,null,null,"-"]
["043","Gorivo i energija (AOP 040 do 045)",39,{"$f":"SUM(D51:D56)","v":0},{"$f":"SUM(E51:E56)","v":0},"-"]
["0431","Ugljen i ostala kruta mineralna goriva",40,null,null,"-"]
["0432","Nafta i prirodni plin",41,null,null,"-"]
["0433","Nuklearno gorivo",42,null,null,"-"]
["0434","Ostala goriva",43,null,null,"-"]
["0435","Električna energija",44,null,null,"-"]
["0436","Ostale vrste energije",45,null,null,"-"]
["044","Rudarstvo, proizvodnja i građevinarstvo (AOP 047 do 049)",46,{"$f":"SUM(D58:D60)","v":0},{"$f":"SUM(E58:E60)","v":0},"-"]
["0441","Rudarstvo, mineralni resursi i ostala mineralna goriva",47,null,null,"-"]
["0442","Proizvodnja ",48,null,null,"-"]
["0443","Građevinarstvo",49,null,null,"-"]
["045","Promet (AOP 051 do 055)",50,{"$f":"SUM(D62:D66)","v":0},{"$f":"SUM(E62:E66)","v":0},"-"]
["0451","Cestovni promet",51,null,null,"-"]
["0452","Promet vodnim putovima",52,null,null,"-"]
["0453","Željeznički promet",53,null,null,"-"]
["0454","Zračni promet",54,null,null,"-"]
["0455","Promet cjevovodima i ostali promet",55,null,null,"-"]
["046","Komunikacije",56,null,null,"-"]
["047","Ostale industrije (AOP 058 do 061)",57,{"$f":"SUM(D69:D72)","v":0},{"$f":"SUM(E69:E72)","v":0},"-"]
["0471","Distribucija i skladištenje",58,null,null,"-"]
["0472","Hoteli i restorani",59,null,null,"-"]
["0473","Turizam",60,null,null,"-"]
["0474","Višenamjenski razvojni projekti",61,null,null,"-"]
["048","Istraživanje i razvoj: Ekonomski poslovi (AOP 063 do 069)",62,{"$f":"SUM(D74:D80)","v":0},{"$f":"SUM(E74:E80)","v":0},"-"]
["0481","Istraživanje i razvoj: Opći ekonomski, trgovački i poslovi vezani uz rad",63,null,null,"-"]
["0482","Istraživanje i razvoj: Poljoprivreda, šumarstvo, ribarstvo i lov",64,null,null,"-"]
["0483","Istraživanje i razvoj: Gorivo i energija",65,null,null,"-"]
["0484","Istraživanje i razvoj: Rudarstvo, proizvodnja i građevinarstvo",66,null,null,"-"]
["0485","Istraživanje i razvoj: Promet",67,null,null,{"$f":"IF(D78>0,IF(E78/D78>=100,\">>100\",E78/D78*100),\"-\")","v":"-"}]
["0486","Istraživanje i razvoj: Komunikacije",68,null,null,"-"]
["0487","Istraživanje i razvoj: Ostale industrije",69,null,null,"-"]
["049","Ekonomski poslovi koji nisu drugdje svrstani",70,null,null,"-"]
["05","Zaštita okoliša (AOP 072 do 077)",71,{"$f":"SUM(D83:D88)","v":0},{"$f":"SUM(E83:E88)","v":0},"-"]
["051","Gospodarenje otpadom",72,null,null,"-"]
["052","Gospodarenje otpadnim vodama",73,null,null,"-"]
["053","Smanjenje zagađivanja",74,null,null,"-"]
["054","Zaštita bioraznolikosti i krajolika",75,null,null,"-"]
["055","Istraživanje i razvoj: Zaštita okoliša",76,null,null,"-"]
["056","Poslovi i usluge zaštite okoliša koji nisu drugdje svrstani",77,null,null,"-"]
["06","Usluge unapređenja stanovanja i zajednice (AOP 079 do 084)",78,{"$f":"SUM(D90:D95)","v":0},{"$f":"SUM(E90:E95)","v":0},"-"]
["061","Razvoj stanovanja",79,null,null,"-"]
["062","Razvoj zajednice",80,null,null,"-"]
["063","Opskrba vodom",81,null,null,"-"]
["064","Ulična rasvjeta",82,null,null,"-"]
["065","Istraživanje i razvoj stanovanja i komunalnih pogodnosti",83,null,null,"-"]
["066","Rashodi vezani za stanovanje i kom. pogodnosti koji nisu drugdje svrstani",84,null,null,"-"]
["07","Zdravstvo (AOP 086+090+095+100+101+102)",85,{"$f":"D97+D101+D106+D111+D112+D113","v":0},{"$f":"E97+E101+E106+E111+E112+E113","v":0},"-"]
["071","Medicinski proizvodi, pribor i oprema (AOP 087 do 089)",86,{"$f":"SUM(D98:D100)","v":0},{"$f":"SUM(E98:E100)","v":0},"-"]
["0711","Farmaceutski proizvodi",87,null,null,"-"]
["0712","Ostali medicinski proizvodi",88,null,null,"-"]
["0713","Terapeutski pribor i oprema",89,null,null,"-"]
["072","Službe za vanjske pacijente (AOP 091 do 094)",90,{"$f":"SUM(D102:D105)","v":0},{"$f":"SUM(E102:E105)","v":0},"-"]
["0721","Opće medicinske usluge",91,null,null,"-"]
["0722","Specijalističke medicinske usluge",92,null,null,"-"]
["0723","Zubarske usluge",93,null,null,"-"]
["0724","Paramedicinske usluge ",94,null,null,"-"]
["073","Bolničke službe (AOP 096 do 099)",95,{"$f":"SUM(D107:D110)","v":0},{"$f":"SUM(E107:E110)","v":0},"-"]
["0731","Usluge općih bolnica",96,null,null,"-"]
["0732","Usluge specijalističkih bolnica",97,null,null,"-"]
["0733","Usluge medicinskih centara i centara za majčinstvo",98,null,null,"-"]
["0734","Usluge centara za njegu i oporavak",99,null,null,"-"]
["074","Službe javnog zdravstva",100,null,null,"-"]
["075","Istraživanje i razvoj zdravstva",101,null,null,"-"]
["076","Poslovi i usluge zdravstva koji nisu drugdje svrstani",102,null,null,"-"]
["08","Rekreacija, kultura i religija (AOP 104 do 109)",103,{"$f":"SUM(D115:D120)","v":0},{"$f":"SUM(E115:E120)","v":0},"-"]
["081","Službe rekreacije i sporta",104,null,null,"-"]
["082","Službe kulture",105,null,null,"-"]
["083","Službe emitiranja i izdavanja",106,null,null,"-"]
["084","Religijske i druge službe zajednice",107,null,null,"-"]
["085","Istraživanje i razvoj rekreacije, kulture i religije",108,null,null,"-"]
["086","Rashodi za rekreaciju, kulturu i religiju koji nisu drugdje svrstani",109,null,null,"-"]
["09","Obrazovanje (AOP 111+114+117+118+121 do 124)",110,{"$f":"D122+D125+D128+D129+SUM(D132:D135)","v":7358507},{"$f":"E122+E125+E128+E129+SUM(E132:E135)","v":7894608},107.28545885734701]
["091","Predškolsko i osnovno obrazovanje (AOP 112+113)",111,{"$f":"SUM(D123:D124)","v":6940557},{"$f":"SUM(E123:E124)","v":7433792},107.10656219666519]
["0911","Predškolsko obrazovanje",112,null,null,"-"]
["0912","Osnovno obrazovanje",113,6940557,7433792,107.10656219666519]
["092","Srednjoškolsko obrazovanje (AOP 115+116)",114,{"$f":"SUM(D126:D127)","v":0},{"$f":"SUM(E126:E127)","v":0},"-"]
["0921","Niže srednjoškolsko obrazovanje",115,null,null,"-"]
["0922","Više srednjoškolsko obrazovanje",116,null,null,"-"]
["093","Poslije srednjoškolsko, ali ne visoko obrazovanje",117,null,null,"-"]
["094","Visoka naobrazba (AOP 119+120)",118,{"$f":"SUM(D130:D131)","v":0},{"$f":"SUM(E130:E131)","v":0},"-"]
["0941","Prvi stupanj visoke naobrazbe",119,null,null,"-"]
["0942","Drugi stupanj visoke naobrazbe",120,null,null,"-"]
["095","Obrazovanje koje se ne može definirati po stupnju",121,417950,460816,110.25625074769709]
["096","Dodatne usluge u obrazovanju",122,null,null,"-"]
["097","Istraživanje i razvoj obrazovanja",123,null,null,"-"]
["098","Usluge obrazovanja koje nisu drugdje svrstane",124,null,null,"-"]
["10","Socijalna zaštita (AOP 126+129 do 136)",125,{"$f":"D137+D140+SUM(D141:D147)","v":0},{"$f":"E137+E140+SUM(E141:E147)","v":0},"-"]
["101","Bolest i invaliditet (AOP 127+128)",126,{"$f":"SUM(D138:D139)","v":0},{"$f":"SUM(E138:E139)","v":0},"-"]
["1011","Bolest",127,null,null,"-"]
["1012","Invaliditet",128,null,null,"-"]
["102","Starost",129,null,null,"-"]
["103","Slijednici",130,null,null,{"$f":"IF(D141>0,IF(E141/D141>=100,\">>100\",E141/D141*100),\"-\")","v":"-"}]
["104","Obitelj i djeca",131,null,null,{"$f":"IF(D142>0,IF(E142/D142>=100,\">>100\",E142/D142*100),\"-\")","v":"-"}]
["105","Nezaposlenost",132,null,null,"-"]
["106","Stanovanje",133,null,null,"-"]
["107","Socijalna pomoć stanovništvu koje nije obuhvaćeno redovnim socijalnim programima",134,null,null,"-"]
["108","Istraživanje i razvoj socijalne zaštite",135,null,null,"-"]
["109","Aktivnosti socijalne zaštite koje nisu drugdje svrstane",136,null,null,"-"]
[null,"Kontrolni zbroj (AOP 001+018+024+031+071+078+085+103+110+125)",137,{"$f":"D12+D29+D35+D42+D82+D89+D96+D114+D121+D136","v":7358507},{"$f":"E12+E29+E35+E42+E82+E89+E96+E114+E121+E136","v":7894608},107.28545885734701]
[]
["U _________________________________________, dana: ____.____.________.",null,null,"Odgoovorna osoba (potpis)"]
[{"$f":"IF(RefStr!H25<>\"\", \"Osoba za kontaktiranje: \" & RefStr!H25,\"Osoba za kontaktiranje: _________________________________________\")","v":"Osoba za kontaktiranje: Robertina Filić"}]
[{"$f":"IF(RefStr!H27=\"\",\"Telefon za kontakt: _________________\",\"Telefon za kontakt: \" & RefStr!H27)","v":"Telefon za kontakt: 031496682"}]
[{"$f":"IF(RefStr!H33=\"\",\"Odgovorna osoba: _____________________________\",\"Odgovorna osoba: \" & RefStr!H33)","v":"Odgovorna osoba: JOSIP JUKIĆ"}]

{"sheet":"PVRIO","index":6,"n_rows":61,"n_cols":5,"rows_kept":61,"cut":false,"hidden":false,"merged":[[0,0,0,1],[1,3,1,4],[1,0,1,2],[2,0,2,2],[0,2,0,4],[3,3,3,4],[3,1,3,2],[57,3,57,4],[5,1,5,5],[6,1,6,5],[4,3,4,4],[4,1,4,2]]}
["<–––– Povratak na RefStr",null,"Kontrole obrasca P-VRIO ––––>"]
["IZVJEŠTAJ O PROMJENAMA U VRIJEDNOSTI\nI OBUJMU IMOVINE I OBVEZA",null,null,"Obrazac P-VRIO\n(VP 156)"]
[{"$f":"\"za razdoblje \"&IF(RefStr!K10=\"\",\"________________\",TEXT(RefStr!K10,\"d.mmmm yyyy.\")&\" do \"&IF(RefStr!K12=\"\",\"______________\",TEXT(RefStr!K12,\"d. mmmm yyyy.\")))","v":"za razdoblje 1.siječanj 2017. do 31. prosinac 2017."}]
["Obveznik:",{"$f":"\"RKP: \"&IF(RefStr!B6<>\"\",TEXT(INT(VALUE(RefStr!B6)),\"00000\"),\"_____\"&\",  \"&\"MB: \"&IF(RefStr!B8<>\"\",TEXT(INT(VALUE(RefStr!B8)),\"00000000\"),\"________\")&\"  OIB: \"&IF(RefStr!K14<>\"\",RefStr!K14,\"___________\"))","v":"RKP: 09431"},null,{"$f":"SUM(Skriveni!G1424:G1467)","v":4167.098}]
[null,{"$f":"\"Naziv: \"&IF(RefStr!B10<>\"\",RefStr!B10,\"_______________________________________\")","v":"Naziv: OŠ MLADOST OSIJEK"},null,"Kontrolni broj obrasca"]
[null,{"$f":" \"Razina: \" & RefStr!B16 & \", Razdjel: \" & TEXT(INT(VALUE(RefStr!B20)), \"000\")","v":"Razina: 31, Razdjel: 000"}]
[null,{"$f":"\"Djelatnost: \" & RefStr!B18 & \" \" & RefStr!C18","v":"Djelatnost: 8520 Osnovno obrazovanje"}]
[]
[]
["Račun iz rač. plana","NAZIV","AOP","Iznos povećanja","Iznos smanjenja"]
[1,2,3,4,5]
["9151","Promjene u vrijednosti i obujmu imovine (AOP 002+018)",1,{"$f":"D13+D29","v":0},{"$f":"E13+E29","v":35027}]
["91511","Promjene u vrijednosti (revalorizacija) imovine (AOP 003+010)",2,{"$f":"D14+D21","v":0},{"$f":"E14+E21","v":0}]
[" ","Promjene u vrijednosti (revalorizacija) nefinancijske imovine (AOP 004 do 009)",3,{"$f":"SUM(D15:D20)","v":0},{"$f":"SUM(E15:E20)","v":0}]
[" ","Neproizvedena dugotrajna imovina",4]
[" ","Proizvedena dugotrajna imovina",5]
[" ","Plemeniti metali i ostale pohranjene vrijednosti",6]
[" ","Sitni inventar",7]
[" ","Dugotrajna nefinancijska imovina u pripremi",8]
[" ","Proizvedena kratkotrajna imovina",9]
[" ","Promjene u vrijednosti (revalorizacija) financijske imovine (AOP 011 do 017)",10,{"$f":"SUM(D22:D28)","v":0},{"$f":"SUM(E22:E28)","v":0}]
[" ","Novac u banci i blagajni",11]
[" ","Depoziti, jamčevni polozi i potraživanja od zaposlenih te za više plaćene poreze i ostalo",12]
[" ","Potraživanja za dane zajmove ",13]
[" ","Vrijednosni papiri",14]
[" ","Dionice i udjeli u glavnici",15]
[" ","Potraživanja za prihode poslovanja",16]
[" ","Potraživanja od prodaje nefinancijske imovine",17]
["91512","Promjene u obujmu imovine (AOP 019+026)",18,{"$f":"D30+D37","v":0},{"$f":"E30+E37","v":35027}]
[" ","Promjene u obujmu nefinancijske imovine (AOP 020 do 025)",19,{"$f":"SUM(D31:D36)","v":0},{"$f":"SUM(E31:E36)","v":35027}]
[" ","Neproizvedena dugotrajna imovina",20]
[" ","Proizvedena dugotrajna imovina",21,null,26549]
[" ","Plemeniti metali i ostale pohranjene vrijednosti",22]
[" ","Sitni inventar",23,null,8478]
[" ","Dugotrajna nefinancijska imovina u pripremi",24]
[" ","Proizvedena kratkotrajna imovina",25]
[" ","Promjene u obujmu financijske imovine (AOP 027 do 033)",26,{"$f":"SUM(D38:D44)","v":0},{"$f":"SUM(E38:E44)","v":0}]
[" ","Novac u banci i blagajni",27]
[" ","Depoziti, jamčevni polozi i potraživanja od zaposlenih te za više plaćene poreze i ostalo",28]
[" ","Potraživanja za dane zajmove ",29]
[" ","Vrijednosni papiri",30]
[" ","Dionice i udjeli u glavnici",31]
[" ","Potraživanja za prihode poslovanja",32]
[" ","Potraživanja od prodaje nefinancijske imovine",33]
["9152","Promjene u vrijednosti (revalorizacija) i obujmu obveza (AOP 035+040)",34,{"$f":"D46+D51","v":0},{"$f":"E46+E51","v":0}]
["91521","Promjene u vrijednosti (revalorizacija) obveza (AOP 036 do 039)",35,{"$f":"SUM(D47:D50)","v":0},{"$f":"SUM(E47:E50)","v":0}]
[" ","Obveze za rashode poslovanja",36]
[" ","Obveze za nabavu nefinancijske imovine",37]
[" ","Obveze za vrijednosne papire",38]
[" ","Obveze za kredite i zajmove",39]
["91522","Promjene u obujmu obveza (AOP 041 do 044)",40,{"$f":"SUM(D52:D55)","v":0},{"$f":"SUM(E52:E55)","v":0}]
[" ","Obveze za rashode poslovanja",41]
[" ","Obveze za nabavu nefinancijske imovine",42]
[" ","Obveze za vrijednosne papire",43]
[null,"Obveze za kredite i zajmove",44]
[]
[]
["U _________________________________________, dana: ____.____.________.",null,null,"Odgoovorna osoba (potpis)"]
[{"$f":"IF(RefStr!H25<>\"\", \"Osoba za kontaktiranje: \" & RefStr!H25,\"Osoba za kontaktiranje: _________________________________________\")","v":"Osoba za kontaktiranje: Robertina Filić"}]
[{"$f":"IF(RefStr!H27=\"\",\"Telefon za kontakt: _________________\",\"Telefon za kontakt: \" & RefStr!H27)","v":"Telefon za kontakt: 031496682"}]
[{"$f":"IF(RefStr!H33=\"\",\"Odgovorna osoba: _____________________________\",\"Odgovorna osoba: \" & RefStr!H33)","v":"Odgovorna osoba: JOSIP JUKIĆ"}]

{"sheet":"Obv","index":7,"n_rows":111,"n_cols":4,"rows_kept":111,"cut":false,"hidden":false,"merged":[[3,2,3,3],[107,2,107,3],[4,2,4,3],[5,1,5,3],[6,1,6,3],[0,0,0,1],[1,2,1,3],[1,0,1,1],[2,0,2,1],[0,2,0,3]]}
["<–––– Povratak na RefStr",null,"Kontrole ––––>"]
["IZVJEŠTAJ O OBVEZAMA",null,"Obveze\n(VP 159)"]
[{"$f":"\"za razdoblje \"&IF(RefStr!K10=\"\",\"________________\",TEXT(RefStr!K10,\"d.mmmm yyyy.\")&\" do \"&IF(RefStr!K12=\"\",\"______________\",TEXT(RefStr!K12,\"d. mmmm yyyy.\")))","v":"za razdoblje 1.siječanj 2017. do 31. prosinac 2017."}]
["Obveznik:",{"$f":"\"RKP: \"&IF(RefStr!B6<>\"\",TEXT(INT(VALUE(RefStr!B6)),\"00000\"),\"_____\"&\",  \"&\"MB: \"&IF(RefStr!B8<>\"\",TEXT(INT(VALUE(RefStr!B8)),\"00000000\"),\"________\")&\"  OIB: \"&IF(RefStr!K14<>\"\",RefStr!K14,\"___________\"))","v":"RKP: 09431"},{"$f":"SUM(Skriveni!G1468:G1561)","v":725610.9530000001}]
[null,{"$f":"\"Naziv: \"&IF(RefStr!B10<>\"\",RefStr!B10,\"_______________________________________\")","v":"Naziv: OŠ MLADOST OSIJEK"},"Kontrolni broj obrasca"]
[null,{"$f":" \"Razina: \" & RefStr!B16 & \", Razdjel: \" & TEXT(INT(VALUE(RefStr!B20)), \"000\")","v":"Razina: 31, Razdjel: 000"}]
[null,{"$f":"\"Djelatnost: \" & RefStr!B18 & \" \" & RefStr!C18","v":"Djelatnost: 8520 Osnovno obrazovanje"}]
[]
[null,null,null,"iznosi u kunama, bez lipa"]
["Račun iz rač. plana","OPIS","AOP","Iznos"]
[1,2,3,4]
[null,"Stanje obveza 1. siječnja (=AOP 036* iz Izvještaja o obvezama za prethodnu godinu)",1,597788]
[null,"Povećanje obveza u izvještajnom razdoblju (AOP 003+004+012+013)",2,{"$f":"D14+D15+D23+D24","v":7940231}]
[null,"Međusobne obveze proračunskih korisnika",3,43354]
["23","Obveze za rashode poslovanja (AOP 005 do 011)",4,{"$f":"SUM(D16:D22)","v":7842913}]
["231","Obveze za zaposlene",5,6380729]
["232","Obveze za materijalne rashode",6,1425026]
["234","Obveze za financijske rashode",7,37158]
["235","Obveze za subvencije",8]
["237","Obveze za naknade građanima i kućanstvima",9]
["238","Obveze za kazne, naknade šteta i kapitalne pomoći",10]
["239","Ostale tekuće obveze",11]
["24","Obveze za nabavu nefinancijske imovine",12,53964]
["dio 25,26","Obveze za financijsku imovinu (AOP 014 do 018)",13,{"$f":"SUM(D25:D29)","v":0}]
[251.25299999999999,"Obveze za čekove i mjenice",14]
["254","Obveze za obveznice",15]
["256","Obveze za ostale vrijednosne papire",16]
["262,263,2643,2644,\n2645,2653,2654,267","Obveze za tuzemne kredite i zajmove",17]
["261,2646,2647, 2648,2655,2656","Obveze za inozemne kredite i zajmove",18]
[null,"Podmirene obveze u izvještajnom razdoblju (AOP 020+021+029+030)",19,{"$f":"D31+D32+D40+D41","v":7846498}]
[null,"Međusobne obveze proračunskih korisnika",20,29994]
["23","Obveze za rashode poslovanja (AOP 022 do 028)",21,{"$f":"SUM(D33:D39)","v":7762540}]
["231","Obveze za zaposlene",22,6306750]
["232","Obveze za materijalne rashode",23,1417962]
["234","Obveze za financijske rashode",24,37828]
["235","Obveze za subvencije",25]
["237","Obveze za naknade građanima i kućanstvima",26]
["238","Obveze za kazne, naknade šteta i kapitalne pomoći",27]
["239","Ostale tekuće obveze",28]
["24","Obveze za nabavu nefinancijske imovine",29,53964]
["dio 25,26","Obveze za financijsku imovinu (AOP 031 do 035)",30,{"$f":"SUM(D42:D46)","v":0}]
[251.25299999999999,"Obveze za čekove i mjenice",31]
["254","Obveze za obveznice",32]
["256","Obveze za ostale vrijednosne papire",33]
["262,263,2643,2644, 2645,2653,2654,267","Obveze za tuzemne kredite i zajmove",34]
["261,2646,2647, 2648,2655,2656","Obveze za inozemne kredite i zajmove",35]
[null,"Stanje obveza na kraju izvještajnog razdoblja (AOP 001+002-019) i (AOP 037+090)",36,{"$f":"D12+D13-D30","v":691521}]
[null,"Stanje dospjelih obveza na kraju izvještajnog razdoblja (AOP 038+043+079+084)",37,{"$f":"D49+D54+D90+D95","v":14900}]
[null,"Međusobne obveze proračunskih korisnika (AOP 039 do 042)",38,{"$f":"SUM(D50:D53)","v":14900}]
[null,"a) Prekoračenje 1 do 60 dana",39,14900]
[null,"b) Prekoračenje 61 do 180 dana",40]
[null,"c) Prekoračenje 181 do 360 dana",41]
[null,"d) Prekoračenje preko 360 dana",42]
["23","Ukupno obveze za rashode poslovanja (AOP 044+049+054+059+064+069+074)",43,{"$f":"D55+D60+D65+D70+D75+D80+D85","v":0}]
["231","Obveze za zaposlene (AOP 045 do 048)",44,{"$f":"SUM(D56:D59)","v":0}]
[null,"a) Prekoračenje 1 do 60 dana",45]
[null,"b) Prekoračenje 61 do 180 dana",46]
[null,"c) Prekoračenje 181 do 360 dana",47]
[null,"d) Prekoračenje preko 360 dana",48]
["232","Obveze za materijalne rashode (AOP 050 do 053)",49,{"$f":"SUM(D61:D64)","v":0}]
[null,"a) Prekoračenje 1 do 60 dana",50]
[null,"b) Prekoračenje 61 do 180 dana",51]
[null,"c) Prekoračenje 181 do 360 dana",52]
[null,"d) Prekoračenje preko 360 dana",53]
["234","Obveze za financijske rashode (AOP 055 do 058)",54,{"$f":"SUM(D66:D69)","v":0}]
[null,"a) Prekoračenje 1 do 60 dana",55]
[null,"b) Prekoračenje 61 do 180 dana",56]
[null,"c) Prekoračenje 181 do 360 dana",57]
[null,"d) Prekoračenje preko 360 dana",58]
["235","Obveze za subvencije (AOP 060 do 063)",59,{"$f":"SUM(D71:D74)","v":0}]
[null,"a) Prekoračenje 1 do 60 dana",60]
[null,"b) Prekoračenje 61 do 180 dana",61]
[null,"c) Prekoračenje 181 do 360 dana",62]
[null,"d) Prekoračenje preko 360 dana",63]
["237","Obveze za naknade građanima i kućanstvima (AOP 065 do 068)",64,{"$f":"SUM(D76:D79)","v":0}]
[null,"a) Prekoračenje 1 do 60 dana",65]
[null,"b) Prekoračenje 61 do 180 dana",66]
[null,"c) Prekoračenje 181 do 360 dana",67]
[null,"d) Prekoračenje preko 360 dana",68]
["238","Obveze za kazne, naknade šteta i kapitalne pomoći (AOP 070 do 073)",69,{"$f":"SUM(D81:D84)","v":0}]
[null,"a) Prekoračenje 1 do 60 dana",70]
[null,"b) Prekoračenje 61 do 180 dana",71]
[null,"c) Prekoračenje 181 do 360 dana",72]
[null,"d) Prekoračenje preko 360 dana",73]
["239","Ostale tekuće obveze (AOP 075 do 078)",74,{"$f":"SUM(D86:D89)","v":0}]
[null,"a) Prekoračenje 1 do 60 dana",75]
[null,"b) Prekoračenje 61 do 180 dana",76]
[null,"c) Prekoračenje 181 do 360 dana",77]
[null,"d) Prekoračenje preko 360 dana",78]
["24","Obveze za nabavu nefinancijske imovine (AOP 080 do 083)",79,{"$f":"SUM(D91:D94)","v":0}]
[null,"a) Prekoračenje 1 do 60 dana",80]
[null,"b) Prekoračenje 61 do 180 dana",81]
[null,"c) Prekoračenje 181 do 360 dana",82]
[null,"d) Prekoračenje preko 360 dana",83]
["dio 25,26","Obveze za financijsku imovinu (AOP 085 do 089)",84,{"$f":"SUM(D96:D100)","v":0}]
[251.25299999999999,"Obveze za čekove i mjenice",85]
["254","Obveze za obveznice",86]
["256","Obveze za ostale vrijednosne papire",87]
["262,263,2643,2644, 2645,2653,2654,267","Obveze za tuzemne kredite i zajmove",88]
["261,2646,2647, 2648,2655,2656","Obveze za inozemne kredite i zajmove",89]
[null,"Stanje nedospjelih obveza na kraju izvještajnog razdoblja (AOP 091 do 094)",90,{"$f":"SUM(D102:D105)","v":676621}]
[null,"Međusobne obveze proračunskih korisnika",91]
["23","Obveze za rashode poslovanja",92,676621]
["24","Obveze za nabavu nefinancijske imovine",93]
["dio 25,26","Obveze za financijsku imovinu",94]
["* U 2017. godini, pozicija se odnosi na AOP 038 iz izvještaja za 2016. godinu kada je broj AOP pozicija bio drugačiji"]
[]
["U _________________________________________, dana: ____.____.________.",null,"Odgoovorna osoba (potpis)"]
[{"$f":"IF(RefStr!H25<>\"\", \"Osoba za kontaktiranje: \" & RefStr!H25,\"Osoba za kontaktiranje: _________________________________________\")","v":"Osoba za kontaktiranje: Robertina Filić"}]
[{"$f":"IF(RefStr!H27=\"\",\"Telefon za kontakt: _________________\",\"Telefon za kontakt: \" & RefStr!H27)","v":"Telefon za kontakt: 031496682"}]
[{"$f":"IF(RefStr!H33=\"\",\"Odgovorna osoba: _____________________________\",\"Odgovorna osoba: \" & RefStr!H33)","v":"Odgovorna osoba: JOSIP JUKIĆ"}]

{"sheet":"Kont","index":8,"n_rows":299,"n_cols":21,"rows_kept":299,"cut":false,"hidden":false,"merged":[[287,0,287,2],[291,0,291,2],[296,0,296,2],[260,0,260,2],[1,0,1,2],[3,0,3,2],[22,0,22,2],[17,0,17,2]]}
["BR","TOCAN","OPIS",null,"REZ"]
["<–––– Povratak na RefStr",null,null,"NISTA","KONTROLE","UPOZORENJA","GODINA","MJESEC","RAZINA","PR-RAS","RASF","PVRIO","BIL","OBV","RKP","RAZDJEL","KAO_KONS"]
["Rbr.","Rezultat kontrole","Opis dodatne kontrole",null,{"$f":"E4+E18+E23+E261+E288+E292+E297","v":0},{"$f":"F4+F18+F23+F261+F288+F292+F297","v":0},{"$f":"IF(RefStr!F6<>\"\",INT(VALUE(MID(RefStr!F6,1,4))),0)","v":2017},{"$f":"IF(RefStr!F6<>\"\",INT(VALUE(MID(RefStr!F6,6,2))),0)","v":12},{"$f":"RefStr!B16","v":31},{"$f":"RefStr!B25","v":"DA"},{"$f":"RefStr!B29","v":"DA"},{"$f":"RefStr!B31","v":"DA"},{"$f":"RefStr!B27","v":"DA"},{"$f":"RefStr!B33","v":"DA"},{"$f":"RefStr!B6","v":9431},{"$f":"RefStr!B20","v":0},{"$f":"RefStr!I8","v":"NE"}]
["OPĆE KONTROLE - Kontrole podataka iz zaglavlja i kontrole popunjenosti obrazaca",null,null,null,{"$f":"SUM(E5:E17)","v":0},{"$f":"SUM(F5:F17)","v":0}]
[1,{"$f":"IF(E5=1,\"Pogreška\",IF(F5=1,\"Provjera\",\"O.K.\"))","v":"O.K."},"Oznaku razdjela upisuju samo obveznici razine 11 i 12, dok sve ostale razine u polje razdjel upisuju nulu. Kontrola javlja pogrešku ako za razinu 11 ili 12 razdjel nije upisan ili ako je upisan za bilo koju drugu razinu.",null,{"$f":"MAX(G5:L5)","v":0},0,{"$f":"IF(AND(OR(I3=11,I3=12),P3=0),1,0)","v":0},{"$f":"IF(AND(I3<>11,I3<>12,P3<>0),1,0)","v":0}]
[{"$f":"1+A5","v":2},{"$f":"IF(E6=1,\"Pogreška\",IF(F6=1,\"Provjera\",\"O.K.\"))","v":"O.K."},"Kod tromjesečnih i devetomjesečnih izvještaja ne predaju se konsolidirani izvještaji razine 23. Kontrola javlja pogrešku ako ste za jedno od tih razdoblja upisali oznaku razine 23. Za razinu 12 moguće je predati samo obrazac Obveze.",null,{"$f":"MAX(G6:L6)","v":0},0,{"$f":"IF(AND(OR($H$3=3,$H$3=9),$I$3=23),1,0)","v":0},{"$f":"IF(AND(OR($H$3=3,$H$3=9),$I$3=12,OR(J3<>\"NE\",K3<>\"NE\",L3<>\"NE\",M3<>\"NE\",N3<>\"DA\")),1,0)","v":0},null,null,null,null,null,null,null,null,null,null,null,null,{"$f":"IF(LOOKUP(O3,U7:U295,U7:U295)=O3,1,0)","v":0}]
[{"$f":"1+A6","v":3},{"$f":"IF(E7=1,\"Pogreška\",IF(F7=1,\"Provjera\",\"O.K.\"))","v":"O.K."},"Samo razina 11 i 22 mogu pored opcije \"Izvještaj vrijedi i kao konsolidirani\" upisati \"DA\" (razina 22 za polugodište i godinu, a razina 11 dodatno i za kvartale). Ovo \"DA\" znači da obveznik nema koga konsolidirati pa je konsolidirani izvještaj identičan nekonsolidiranom. Svi ostali obveznici ovdje upisuju \"NE\". Ako kontrola javlja pogrešku, znači da ovo polje nije popunjeno ili obveznik ne spada u grupu onih koji mogu predati identičan konsolidiran i nekonsolidiran izvještaj.",null,{"$f":"MAX(G7:K7)","v":0},{"$f":"MAX(L7:Q7)","v":0},{"$f":"IF(AND(Q3<>\"NE\",Q3<>\"DA\"),1,0)","v":0},{"$f":"IF(AND(Q3=\"DA\",I3<>11,I3<>22),1,0)","v":0},{"$f":"IF(AND(Q3=\"DA\",I3=22,OR(H3=3,H3=9)),1,0)","v":0},{"$f":"IF(AND(Q3=\"DA\",U6=0),1,0)","v":0},null,{"$f":"IF(Q3=\"DA\",1,0)","v":0},null,null,null,null,null,null,null,null,0]
[4,{"$f":"IF(E8=1,\"Pogreška\",IF(F8=1,\"Provjera\",\"O.K.\"))","v":"O.K."},"Popunjenost zaglavlja referentne stranice. Svi podaci u zaglavlju čiji opis je u tamnoplavoj boji moraju biti popunjeni, za one koji nemaju razdjel neka upišu nulu, polje ne smije ostati prazno. Ako ova kontrola javlja pogrešku znači da niste popunili sva neophodna polja u zaglavlju. Takav obrazac neće moći biti zaprimljen. Provjerite još jednom i popunite sva polja na referentnoj stranici.",null,{"$f":"MAX(G8)","v":0},0,{"$f":"IF(AND(Skriveni!L28<>0,OR(RefStr!B6=0,RefStr!B8=0,RefStr!F6=\"\",LEN(RefStr!B10)<3,RefStr!B12=0,LEN(RefStr!C12)<2,LEN(RefStr!B14)<5,LEN(RefStr!H29)<5,RefStr!B16=0,RefStr!B18=\"\",RefStr!B20=\"\",RefStr!B22=0,RefStr!K10=\"\",RefStr!K12=\"\",LEN(RefStr!K14)<6,LEN(RefStr!K14)>11)),1,0)","v":0},null,"3 i 9 mjesec","6. mjesec","12. mjeseci",null,null,null,null,null,null,null,null,null,19]
[5,{"$f":"IF(E9=1,\"Pogreška\",IF(F9=1,\"Provjera\",\"O.K.\"))","v":"O.K."},"Razina 11 (od 2016. godine)\n- za kvartale te za polugodište (I.-III., I.-VI., I.-IX.) predaje PR-RAS obrazac i Obveze\n- za kraj godine predaje SVE obrasce: PR-RAS, BIL, P-VRIO, RAS-funkcijski i Obveze.\nOva kontrola javlja pogrešku ako je popunjen obrazac koji se za upisano razdoblje i razinu ne treba popuniti, ili ako nije popunjen neki koji se treba popuniti.",null,{"$f":"MAX(G9:K9)","v":0},0,null,null,{"$f":"IF(AND($I$3=11,OR($H$3=3,$H$3=9),OR($J$3<>\"DA\",$K$3<>\"NE\",$L$3<>\"NE\",$M$3<>\"NE\",$N$3<>\"DA\")),1,0)","v":0},{"$f":"IF(AND($I$3=11,$H$3=6,OR($J$3<>\"DA\",$K$3<>\"NE\",$L$3<>\"NE\",$M$3<>\"NE\",$N$3<>\"DA\")),1,0)","v":0},{"$f":"IF(AND($I$3=11,$H$3=12,OR($J$3<>\"DA\",$K$3<>\"DA\",$L$3<>\"DA\",$M$3<>\"DA\",$N$3<>\"DA\")),1,0)","v":0},null,null,null,null,null,null,null,null,null,35]
[6,"O.K.","Razina 12 (od 2016. godine)\n- za kvartale (I.-III., I.-IX.) predaje samo obrazac Obveze,\n- za polugodište predaje obrazac PR-RAS te obrazac Obveze\n- za kraj godine predaje SVE obrasce: PR-RAS, BIL, P-VRIO, RAS-funkcijski i Obveze.\nOva kontrola javlja pogrešku ako je popunjen obrazac koji se za upisano razdoblje i razinu ne treba popuniti, ili ako nije popunjen neki koji se treba popuniti.",null,{"$f":"MAX(G10:K10)","v":0},0,null,null,{"$f":"IF(AND($I$3=12,OR($H$3=3,$H$3=9),OR($J$3<>\"NE\",$K$3<>\"NE\",$L$3<>\"NE\",$M$3<>\"NE\",$N$3<>\"DA\")),1,0)","v":0},{"$f":"IF(AND($I$3=12,$H$3=6,OR($J$3<>\"DA\",$K$3<>\"NE\",$L$3<>\"NE\",$M$3<>\"NE\",$N$3<>\"DA\")),1,0)","v":0},{"$f":"IF(AND($I$3=12,$H$3=12,OR(J3<>\"DA\",K3<>\"DA\",L3<>\"DA\",M3<>\"DA\",N3<>\"DA\")),1,0)","v":0},null,null,null,null,null,null,null,null,null,174]
[7,"O.K.","Razina 13, opća država (od 2016. godine)\n- za kvartale te za polugodište (I.-III., I.-VI., I.-IX.) predaje samo obrazac PR-RAS\n- za kraj godine predaje obrasce: PR-RAS, BIL, P-VRIO i RAS-funkcijski.\nOva kontrola javlja pogrešku ako je popunjen obrazac koji se za upisano razdoblje i razinu ne treba popuniti, ili ako nije popunjen neki koji se treba popuniti.",null,{"$f":"MAX(G11:K11)","v":0},0,null,null,{"$f":"IF(AND($I$3=13,OR($H$3=3,$H$3=9),OR($J$3<>\"DA\",$K$3<>\"NE\",$L$3<>\"NE\",$M$3<>\"NE\",$N$3<>\"NE\")),1,0)","v":0},{"$f":"IF(AND($I$3=13,$H$3=6,OR($J$3<>\"DA\",$K$3<>\"NE\",$L$3<>\"NE\",$M$3<>\"NE\",$N$3<>\"NE\")),1,0)","v":0},{"$f":"IF(AND($I$3=13,$H$3=12,OR($J$3<>\"DA\",$K$3<>\"DA\",$L$3<>\"DA\",$M$3<>\"DA\",$N$3<>\"NE\")),1,0)","v":0},null,null,null,null,null,null,null,null,null,721]
[8,"O.K.","Razina 21 (od 2016. godine)\n- za kvartale (prvi i treći kvartal) predaje samo obrazac PR-RAS\n- za polugodište predaje obrasce PR-RAS i Obveze,\n- na godišnjoj razini predaje sve obrasce: PR-RAS, BIL, RAS-funkcijski, P-VRIO i Obveze.\nOva kontrola javlja pogrešku ako je popunjen obrazac koji se za upisano razdoblje i razinu ne treba popuniti, ili ako nije popunjen neki koji se treba popuniti.",null,0,0,null,null,{"$f":"IF(AND($I$3=21,OR($H$3=3,$H$3=9),OR($J$3<>\"DA\",$K$3<>\"NE\",$L$3<>\"NE\",$M$3<>\"NE\",$N$3<>\"NE\")),1,0)","v":0},{"$f":"IF(AND($I$3=21,$H$3=6,OR($J$3<>\"DA\",$K$3<>\"NE\",$L$3<>\"NE\",$M$3<>\"NE\",$N$3<>\"DA\")),1,0)","v":0},{"$f":"IF(AND($I$3=21,$H$3=12,OR($J$3<>\"DA\",$K$3<>\"DA\",$L$3<>\"DA\",$M$3<>\"DA\",$N$3<>\"DA\")),1,0)","v":0},null,null,null,null,null,null,null,null,null,6031]
[9,"O.K.","Razina 22 (od 2016. godine)\n- za kvartale te za polugodište (I.-III., I.-VI., I.-IX.) predaje PR-RAS obrazac i Obveze\n- za kraj godine predaje SVE obrasce: PR-RAS, BIL, P-VRIO, RAS-funkcijski i Obveze.\nOva kontrola javlja pogrešku ako je popunjen obrazac koji se za upisano razdoblje i razinu ne treba popuniti, ili ako nije popunjen neki koji se treba popuniti.",null,0,0,null,null,{"$f":"IF(AND($I$3=22,OR($H$3=3,$H$3=9),OR($J$3<>\"DA\",$K$3<>\"NE\",$L$3<>\"NE\",$M$3<>\"NE\",$N$3<>\"DA\")),1,0)","v":0},{"$f":"IF(AND($I$3=22,$H$3=6,OR($J$3<>\"DA\",$K$3<>\"NE\",$L$3<>\"NE\",$M$3<>\"NE\",$N$3<>\"DA\")),1,0)","v":0},{"$f":"IF(AND($I$3=22,$H$3=12,OR($J$3<>\"DA\",$K$3<>\"DA\",$L$3<>\"DA\",$M$3<>\"DA\",$N$3<>\"DA\")),1,0)","v":0},null,null,null,null,null,null,null,null,null,6040]
[10,"O.K.","Razina 23 (od 2016. godine)\n- za kvartale ne predaje ništa, nema konsolidacije,\n- za polugodište (I.-VI.) predaje obrasce PR-RAS i Obveze\n- za kraj godine predaje SVE obrasce: PR-RAS, BIL, P-VRIO, RAS-funkcijski i Obveze.\nOva kontrola javlja pogrešku ako je popunjen obrazac koji se za upisano razdoblje i razinu ne treba popuniti, ili ako nije popunjen neki koji se treba popuniti.",null,0,0,null,null,{"$f":"IF(AND($I$3=23,OR($H$3=3,$H$3=9)),1,0)","v":0},{"$f":"IF(AND($I$3=23,$H$3=6,OR($J$3<>\"DA\",$K$3<>\"NE\",$L$3<>\"NE\",$M$3<>\"NE\",$N$3<>\"DA\")),1,0)","v":0},{"$f":"IF(AND($I$3=23,$H$3=12,OR($J$3<>\"DA\",$K$3<>\"DA\",$L$3<>\"DA\",$M$3<>\"DA\",$N$3<>\"DA\")),1,0)","v":0},null,null,null,null,null,null,null,null,null,6099]
[11,"O.K.","Razine 31 (od 2016. godine)\n- za kvartale (prvi i treći kvartal) predaje samo obrazac PR-RAS\n- za polugodište predaje obrasce PR-RAS i Obveze\n- na godišnjoj razini predaje sve obrasce: PR-RAS, BIL, RAS-funkcijski, P-VRIO i Obveze. \nOva kontrola javlja pogrešku ako je popunjen obrazac koji se za upisano razdoblje i razinu ne treba popuniti, ili ako nije popunjen neki koji se treba popuniti.",null,0,0,null,null,{"$f":"IF(AND($I$3=31,OR($H$3=3,$H$3=9),OR($J$3<>\"DA\",$K$3<>\"NE\",$L$3<>\"NE\",$M$3<>\"NE\",$N$3<>\"NE\")),1,0)","v":0},{"$f":"IF(AND($I$3=31,$H$3=6,OR($J$3<>\"DA\",$K$3<>\"NE\",$L$3<>\"NE\",$M$3<>\"NE\",$N$3<>\"DA\")),1,0)","v":0},{"$f":"IF(AND($I$3=31,$H$3=12,OR($J$3<>\"DA\",$K$3<>\"DA\",$L$3<>\"DA\",$M$3<>\"DA\",$N$3<>\"DA\")),1,0)","v":0},null,null,null,null,null,null,null,null,null,6138]
[12,"O.K.","Razina 41 (od 2016. godine)\n- za kvartale i polugodište (I.-III., I.-VI. i I.-IX.) predaje obrasce PR-RAS i Obveze\n- na godišnjoj razini predaje sve obrasce: PR-RAS, BIL, RAS-funkcijski, P-VRIO i Obveze. \nOva kontrola javlja pogrešku ako je popunjen obrazac koji se za upisano razdoblje i razinu ne treba popuniti, ili ako nije popunjen neki koji se treba popuniti.",null,0,0,null,null,{"$f":"IF(AND($I$3=41,OR($H$3=3,$H$3=9),OR($J$3<>\"DA\",$K$3<>\"NE\",$L$3<>\"NE\",$M$3<>\"NE\",$N$3<>\"DA\")),1,0)","v":0},{"$f":"IF(AND($I$3=41,$H$3=6,OR($J$3<>\"DA\",$K$3<>\"NE\",$L$3<>\"NE\",$M$3<>\"NE\",$N$3<>\"DA\")),1,0)","v":0},{"$f":"IF(AND($I$3=41,$H$3=12,OR($J$3<>\"DA\",$K$3<>\"DA\",$L$3<>\"DA\",$M$3<>\"DA\",$N$3<>\"DA\")),1,0)","v":0},null,null,null,null,null,null,null,null,null,20833]
[13,"O.K.","Razine 42 (od 2016. godine)\n- za kvartale (prvi i treći kvartal) predaje samo obrazac PR-RAS\n- za polugodište predaje obrasce PR-RAS i Obveze\n- na godišnjoj razini predaje sve obrasce: PR-RAS, BIL, RAS-funkcijski, P-VRIO i Obveze. \nOva kontrola javlja pogrešku ako je popunjen obrazac koji se za upisano razdoblje i razinu ne treba popuniti, ili ako nije popunjen neki koji se treba popuniti.",null,0,0,null,null,{"$f":"IF(AND($I$3=42,OR($H$3=3,$H$3=9),OR($J$3<>\"DA\",$K$3<>\"NE\",$L$3<>\"NE\",$M$3<>\"NE\",$N$3<>\"NE\")),1,0)","v":0},{"$f":"IF(AND($I$3=42,$H$3=6,OR($J$3<>\"DA\",$K$3<>\"NE\",$L$3<>\"NE\",$M$3<>\"NE\",$N$3<>\"DA\")),1,0)","v":0},{"$f":"IF(AND($I$3=42,$H$3=12,OR($J$3<>\"DA\",$K$3<>\"DA\",$L$3<>\"DA\",$M$3<>\"DA\",$N$3<>\"DA\")),1,0)","v":0},null,null,null,null,null,null,null,null,null,21828]
["Kontrole između dva različita obrasca",null,null,null,{"$f":"SUM(E19:E22)","v":0},{"$f":"SUM(F19:F22)","v":0},null,null,null,null,null,null,null,null,null,null,null,null,null,null,23987]
[{"$f":"1+A17","v":14},"O.K.","Na godišnjoj razini, AOP oznaka 158 u obrascu Bilanca mora biti jednaka AOP-u 637 u obrascu PR-RAS. Ova kontrola je obvezujuća za razine 11, 21, 22, 31, 41, 42, a upozoravajuća za razine 12, 13 i 23. Zbog zaokruživanja vrijednosti, dopušteno je odstupanje od 1 kn. Ova kontrola vrijedi u obje kolone podataka, osim za obveznike kod kojih početak razdoblja nije ujedno i početak poslovne godine (obveznik je počeo s radom tokom godine). Za takve obveznike kontrola vrijedi samo za kolonu tekuće godine (ne i prethodne).",null,{"$f":"MAX(G19:K19)","v":0},{"$f":"MAX(L19:P19)","v":0},{"$f":"IF(AND(J3=\"DA\",M3=\"DA\",OR(I3=11,I3=21,I3=22, I3 =31,I3=41,I3=42), A1=1,ABS(Bil!D169-PRRAS!D650)>1,Q19=1),1,0)","v":0},{"$f":"IF(AND(J3=\"DA\",M3=\"DA\",OR(I3=11,I3=21,I3=22, I3 =31,I3=41,I3=42), A1=1,ABS(Bil!E169-PRRAS!E650)>1),1,0)","v":0},null,null,null,{"$f":"IF(AND(J3=\"DA\",M3=\"DA\",OR(I3=11,I3=21,I3=22, I3 =31,I3=41,I3=42), A1=1,ABS(Bil!D169-PRRAS!D650)>1,Q19=1),1,0)","v":0},{"$f":"IF(AND(J3=\"DA\",M3=\"DA\",OR(I3=11,I3=21,I3=22, I3 =31,I3=41,I3=42), A1=1,ABS(Bil!E169-PRRAS!E650)>1),1,0)","v":0},null,null,null,{"$f":"IF(MAX(PRRAS!D11:D981) >0,1,0)","v":1},null,null,null,24027]
[{"$f":"1+A19","v":15},"O.K.","Na godišnjoj razini, AOP oznaka 064 u obrascu Bilanca mora biti jednaka AOP-u 641 u obrascu PR-RAS. Ova kontrola je obvezujuća za razine 11, 21, 22, 31, 41 i 42, a upozoravajuća za razine 12, 13, 23. Zbog zaokruživanja vrijednosti, Dopušteno je odstupanje od 1 kn. Ova kontrola vrijedi u obje kolone podataka.",null,{"$f":"MAX(G20:K20)","v":0},{"$f":"MAX(L20:P20)","v":0},{"$f":"IF(AND(J3=\"DA\",M3=\"DA\",OR(I3=11,I3=21,I3=22, I3 =31,I3=41,I3=42), A1=1,ABS(Bil!D75-PRRAS!D655)>1,Q19=1),1,0)","v":0},{"$f":"IF(AND(J3=\"DA\",M3=\"DA\",OR(I3=11,I3=21,I3=22, I3 =31,I3=41,I3=42), A1=1,ABS(Bil!E75-PRRAS!E655)>1,Q19=1),1,0)","v":0},null,null,null,{"$f":"IF(AND(J3=\"DA\",M3=\"DA\",OR(I3=12,I3=13,I3=23), A1=1,ABS(Bil!D75-PRRAS!D655)>1,Q19=1),1,0)","v":0},{"$f":"IF(AND(J3=\"DA\",M3=\"DA\",OR(I3=12,I3=13,I3=23), A1=1,ABS(Bil!E75-PRRAS!E655)>1,Q19=1),1,0)","v":0},null,null,null,null,null,null,null,24060]
[{"$f":"1+A20","v":16},"O.K.","Na godišnjoj razini, ako je u Bilanci AOP 232 > 236, tada AOP 635 u PR-RAS-u mora biti jednak AOP 232-236 u Bilanci, a AOP 636 mora biti nula. Ako je u Bilanci AOP 236 > 232 tada AOP 636 u PR-RAS-u mora biti jednak AOP 236 - 232 u Bilanci, a AOP 635 u PR-RAS-u mora biti nula. Ova kontrola vrijedi za obje godine osim u slučaju kada je u PR-RAS obrascu kolana prethodne godine nepopunjena. Pri tome je dopuštena razlika od 1 kn zbog zaokruživanja.",null,{"$f":"MAX(G21:L21)","v":0},0,{"$f":"IF(AND($J$3=\"DA\",$M$3=\"DA\",MAX(PRRAS!D12:D972)>0,Bil!D243>=Bil!D247,OR(ABS(Bil!D243-Bil!D247-PRRAS!D648)>1,PRRAS!D649<>0)),1,0)","v":0},{"$f":"IF(AND($J$3=\"DA\",$M$3=\"DA\",Bil!E243>=Bil!E247,OR(ABS(Bil!E243-Bil!E247-PRRAS!E648)>1,PRRAS!E649<>0)),1,0)","v":0},{"$f":"IF(AND($J$3=\"DA\",$M$3=\"DA\",MAX(PRRAS!D12:D972)>0,Bil!D247>=Bil!D243,OR(ABS(Bil!D247-Bil!D243-PRRAS!D649)>1,PRRAS!D648<>0)),1,0)","v":0},{"$f":"IF(AND($J$3=\"DA\",$M$3=\"DA\",Bil!E247>=Bil!E243,OR(ABS(Bil!E247-Bil!E243-PRRAS!E649)>1,PRRAS!E648<>0)),1,0)","v":0},null,null,null,null,null,null,null,null,null,null,24094]
[{"$f":"1+A21","v":17},"O.K.","Ako je obrazac RAS-funkcijski popunjen, tada razlika AOP oznaka 404 i 234 (AOP 404-234) u obrascu PR-RAS treba biti jednaka zbroju svih rashoda po vrstama, tj. AOP-u 137 u obrascu RAS-funkcijski. Zbog zaokruživanja vrijednosti, Dopušteno je odstupanje od 1 kn. Kontrola vrijedi za obje kolone podataka.",null,{"$f":"MAX(G22:L22)","v":0},0,{"$f":"IF(AND(H3=12,J3=\"DA\",K3=\"DA\",I3<>12,I3<>23,ABS(PRRAS!D416-PRRAS!D245-RasF!D148)>1),1,0)","v":0},{"$f":"IF(AND(H3=12,J3=\"DA\",K3=\"DA\",I3<>12,I3<>23,ABS(PRRAS!E416-PRRAS!E245-RasF!E148)>1),1,0)","v":0},null,null,null,null,null,null,null,null,null,null,null,null,25353]
["Kontrole na obrascu PR-RAS",null,null,null,{"$f":"SUM(E24:E260)","v":0},{"$f":"SUM(F24:F260)","v":0},null,null,null,null,null,null,null,null,null,null,null,null,null,null,25860]
[{"$f":"1+A22","v":18},"O.K.","Ako su u nekom stupcu na AOP-ima 642 do 645 (brojevi zaposlenih) podaci veći od nule, tada u toj istom stupcu mora biti postojati podatak veći od nule i na AOP-u 149 (rashodi za zaposlene). Isto tako, ako postoje zaposleni, moraju postojati i rashodi za zaposlene.",null,{"$f":"MAX(G24:L24)","v":0},0,{"$f":"IF(OR(AND(PRRAS!D160=0,MAX(PRRAS!D656:D659)>0),AND(PRRAS!E160=0,MAX(PRRAS!E656:E659)>0)),1,0)","v":0},{"$f":"IF(OR(AND(PRRAS!D160<>0,MAX(PRRAS!D656:D659)=0),AND(PRRAS!E160<>0,MAX(PRRAS!E656:E659)=0)),1,0)","v":0},null,null,null,null,null,null,null,null,null,null,null,null,26049]
[{"$f":"1+A24","v":19},"O.K.","Ako je u nekom stupcu na AOP-u 642 broj veći od nule, tada i na AOP-u 644 mora biti broj veći od nule i obrnuto.",null,{"$f":"MAX(G25:L25)","v":0},0,{"$f":"IF(OR(AND(PRRAS!D656=0,PRRAS!D658<>0),AND(PRRAS!D656<>0,PRRAS!D658=0)),1,0)","v":0},null,null,null,null,null,null,null,null,null,null,null,null,null,26161]
[20,"O.K.","Ako je u nekom stupcu na AOP-u 643 broj veći od nule, tada i na AOP-u 645 mora biti broj veći od nule i obrnuto.",null,{"$f":"MAX(G26:L26)","v":0},0,{"$f":"IF(OR(AND(PRRAS!D657=0,PRRAS!D659<>0),AND(PRRAS!D657<>0,PRRAS!D659=0)),1,0)","v":0},null,null,null,null,null,null,null,null,null,null,null,null,null,26196]
[21,"O.K.","AOP 647 je samo dio AOP-a 019 i mora biti manji ili jednak njemu u oba stupca podataka",null,{"$f":"MAX(G27:L27)","v":0},0,{"$f":"IF(PRRAS!D661>PRRAS!D30,1,0)","v":0},{"$f":"IF(PRRAS!E661>PRRAS!E30,1,0)","v":0},null,null,null,null,null,null,null,null,null,null,null,null,26207]
[22,"O.K.","Zbroj AOP-a: 648+649 je samo dio AOP-a 028 i mora biti manji ili jednak njemu u oba stupca podataka",null,{"$f":"MAX(G28:L28)","v":0},0,{"$f":"IF(PRRAS!D662+PRRAS!D663>PRRAS!D39,1,0)","v":0},{"$f":"IF(PRRAS!E662+PRRAS!E663>PRRAS!E39,1,0)","v":0},null,null,null,null,null,null,null,null,null,null,null,null,26215]
[23,"O.K.","AOP 055 mora biti jednak zbroju AOP-a: 650 do 653 u oba stupca podataka. Zbog zaokruživanja je dopuštena razlika od 1.",null,{"$f":"MAX(G29:L29)","v":0},0,{"$f":"IF(ABS(PRRAS!D66-SUM(PRRAS!D664:D667))>1,1,0)","v":0},{"$f":"IF(ABS(PRRAS!E66-SUM(PRRAS!E664:E667))>1,1,0)","v":0},null,null,null,null,null,null,null,null,null,null,null,null,26223]
[24,"O.K.","AOP 056 mora biti jednak zbroju AOP-a: 654 do 657 u oba stupca podataka. Zbog zaokruživanja je dopuštena razlika od 1.",null,0,0,{"$f":"IF(ABS(PRRAS!D67-SUM(PRRAS!D668:'PRRAS'!D671))>1,1,0)","v":0},{"$f":"IF(ABS(PRRAS!E67-SUM(PRRAS!E668:'PRRAS'!E671))>1,1,0)","v":0},null,null,null,null,null,null,null,null,null,null,null,null,26240]
[25,"O.K.","AOP 058 mora biti jednak zbroju AOP-a: 658 do 660 u oba stupca podataka. Zbog zaokruživanja je dopuštena razlika od 1.",null,0,0,{"$f":"IF(ABS(PRRAS!D69-SUM(PRRAS!D672:D674))>1,1,0)","v":0},{"$f":"IF(ABS(PRRAS!E69-SUM(PRRAS!E672:E674))>1,1,0)","v":0},null,null,null,null,null,null,null,null,null,null,null,null,26725]
[26,"O.K.","AOP 059 mora biti jednak zbroju AOP-a: 661 do 663 u oba stupca podataka",null,0,0,{"$f":"IF(ABS(PRRAS!D70-SUM(PRRAS!D675:D677))>1,1,0)","v":0},{"$f":"IF(ABS(PRRAS!E70-SUM(PRRAS!E675:E677))>1,1,0)","v":0},null,null,null,null,null,null,null,null,null,null,null,null,26733]
[27,"O.K.","AOP 064 mora biti jednak zbroju AOP-a: 664 i 665 u oba stupca podataka",null,{"$f":"MAX(G33:L33)","v":0},0,{"$f":"IF(ABS(PRRAS!D75-PRRAS!D678-PRRAS!D679)>1,1,0)","v":0},{"$f":"IF(ABS(PRRAS!E75-PRRAS!E678-PRRAS!E679)>1,1,0)","v":0},null,null,null,null,null,null,null,null,null,null,null,null,26969]
[28,"O.K.","AOP 065 mora biti jednak zbroju AOP-a: 666 i 667 u oba stupca podataka",null,{"$f":"MAX(G34:L34)","v":0},0,{"$f":"IF(ABS(PRRAS!D76-PRRAS!D680-PRRAS!D681)>1,1,0)","v":0},{"$f":"IF(ABS(PRRAS!E76-PRRAS!E680-PRRAS!E681)>1,1,0)","v":0},null,null,null,null,null,null,null,null,null,null,null,null,26977]
[29,"O.K.","AOP 067 mora biti jednak zbroju AOP-a: 668 do 671 u oba stupca podataka",null,{"$f":"MAX(G35:L35)","v":0},0,{"$f":"IF(ABS(PRRAS!D78-SUM(PRRAS!D682:D685))>1,1,0)","v":0},{"$f":"IF(ABS(PRRAS!E78-SUM(PRRAS!E682:E685))>1,1,0)","v":0},null,null,null,null,null,null,null,null,null,null,null,null,26985]
[30,"O.K.","AOP 068 mora biti jednak zbroju AOP-a: 672 do 675 u oba stupca podataka",null,{"$f":"MAX(G36:L36)","v":0},0,{"$f":"IF(ABS(PRRAS!D79-SUM(PRRAS!D686:D689))>1,1,0)","v":0},{"$f":"IF(ABS(PRRAS!E79-SUM(PRRAS!E686:E689))>1,1,0)","v":0},null,null,null,null,null,null,null,null,null,null,null,null,26993]
[31,"O.K.","AOP 676 je samo dio AOP-a 082 i mora biti manji ili jednak njemu u oba stupca podataka",null,0,0,{"$f":"IF(PRRAS!D690>PRRAS!D93,1,0)","v":0},{"$f":"IF(PRRAS!E690>PRRAS!E93,1,0)","v":0},null,null,null,null,null,null,null,null,null,null,null,null,27038]
[32,"O.K.","AOP 097 mora biti jednak zbroju AOP-a: 677 do 683 u oba stupca podataka. Zbog zaokruživanja je dopuštena razlika od 1.",null,0,0,{"$f":"IF(ABS(PRRAS!D108-SUM(PRRAS!D691:D697))>1,1,0)","v":0},{"$f":"IF(ABS(PRRAS!E108-SUM(PRRAS!E691:E697))>1,1,0)","v":0},null,null,null,null,null,null,null,null,null,null,null,null,27054]
[33,"O.K.","Zbroj AOP-a 684 do 686 je samo dio AOP-a 116 i mora biti manji ili jednak njemu u oba stupca podataka.",null,0,0,{"$f":"IF(SUM(PRRAS!D698:D700)>PRRAS!D127,1,0)","v":0},{"$f":"IF(SUM(PRRAS!E698:E700)>PRRAS!E127,1,0)","v":0},null,null,null,null,null,null,null,null,null,null,null,null,27062]
[34,"O.K.","Zbroj AOP-a 687 i 688 je samo dio AOP-a 155 i mora biti manji ili jednak njemu u oba stupca podataka",null,0,0,{"$f":"IF(PRRAS!D701+PRRAS!D702>PRRAS!D166,1,0)","v":0},{"$f":"IF(PRRAS!E701+PRRAS!E702>PRRAS!E166,1,0)","v":0},null,null,null,null,null,null,null,null,null,null,null,null,27095]
[35,"O.K.","AOP 689 je samo dio AOP-a 163 i mora biti manji ili jednak njemu u oba stupca podataka",null,{"$f":"MAX(G41:L41)","v":0},0,{"$f":"IF(PRRAS!D703>PRRAS!D174,1,0)","v":0},{"$f":"IF(PRRAS!E703>PRRAS!E174,1,0)","v":0},null,null,null,null,null,null,null,null,null,null,null,null,27100]
[36,"O.K.","AOP 690 je samo dio AOP-a 179 i mora biti manji ili jednak njemu u oba stupca podataka",null,0,0,{"$f":"IF(PRRAS!D704>PRRAS!D190,1,0)","v":0},{"$f":"IF(PRRAS!E704>PRRAS!E190,1,0)","v":0},null,null,null,null,null,null,null,null,null,null,null,null,27302]
[37,"O.K.","AOP 691 je samo dio AOP-a 180 i mora biti manji ili jednak njemu u oba stupca podataka",null,0,0,{"$f":"IF(PRRAS!D705>PRRAS!D191,1,0)","v":0},{"$f":"IF(PRRAS!E705>PRRAS!E191,1,0)","v":0},null,null,null,null,null,null,null,null,null,null,null,null,27319]
[38,"O.K.","Zbroj AOP-a 692 do 694 je samo dio AOP-a 181 i mora biti manji ili jednaki njemu u oba stupca podataka",null,0,0,{"$f":"IF(SUM(PRRAS!D706:D708)>PRRAS!D192,1,0)","v":0},{"$f":"IF(SUM(PRRAS!E706:E708)>PRRAS!E192,1,0)","v":0},null,null,null,null,null,null,null,null,null,null,null,null,27327]
[39,"O.K.","AOP 695 je samo dio AOP-a 183 i mora biti manji ili jednak njemu u oba stupca podataka",null,{"$f":"MAX(G45:L45)","v":0},0,{"$f":"IF(PRRAS!D709>PRRAS!D194,1,0)","v":0},{"$f":"IF(PRRAS!E709>PRRAS!E194,1,0)","v":0},null,null,null,null,null,null,null,null,null,null,null,null,27360]
[40,"O.K.","AOP 696 je samo dio AOP-a 186 i mora biti manji ili jednak njemu u oba stupca podataka",null,0,0,{"$f":"IF(PRRAS!D710>PRRAS!D197,1,0)","v":0},{"$f":"IF(PRRAS!E710>PRRAS!E197,1,0)","v":0},null,null,null,null,null,null,null,null,null,null,null,null,27394]
[41,"O.K.","AOP 697 je samo dio AOP-a 187 i mora biti manji ili jednak njemu u oba stupca podataka",null,0,0,{"$f":"IF(PRRAS!D711>PRRAS!D198,1,0)","v":0},{"$f":"IF(PRRAS!E711>PRRAS!E198,1,0)","v":0},null,null,null,null,null,null,null,null,null,null,null,null,27409]
[42,"O.K.","AOP 195 mora biti jednak zbroju AOP-a: 698+699 u oba stupca podataka. Dopušteno je odstupanje od 1kn zbog zaokruživanja.",null,0,0,{"$f":"IF(ABS(PRRAS!D712+PRRAS!D713-PRRAS!D206)>1,1,0)","v":0},{"$f":"IF(ABS(PRRAS!E712+PRRAS!E713-PRRAS!E206)>1,1,0)","v":0},null,null,null,null,null,null,null,null,null,null,null,null,27417]
[43,"O.K.","AOP 196 mora biti jednak zbroju AOP-a: 700+701 u oba stupca podataka. Dopušteno je odstupanje od 1kn zbog zaokruživanja.",null,0,0,{"$f":"IF(ABS(PRRAS!D714+PRRAS!D715-PRRAS!D207)>1,1,0)","v":0},{"$f":"IF(ABS(PRRAS!E714+PRRAS!E715-PRRAS!E207)>1,1,0)","v":0},null,null,null,null,null,null,null,null,null,null,null,null,27425]
[44,"O.K.","AOP 197 mora biti jednak zbroju AOP-a: 702+703 u oba stupca podataka. Dopušteno je odstupanje od 1kn zbog zaokruživanja.",null,0,0,{"$f":"IF(ABS(PRRAS!D716+PRRAS!D717-PRRAS!D208)>1,1,0)","v":0},{"$f":"IF(ABS(PRRAS!E716+PRRAS!E717-PRRAS!E208)>1,1,0)","v":0},null,null,null,null,null,null,null,null,null,null,null,null,27513]
[45,"O.K.","AOP 198 mora biti jednak zbroju AOP-a: 704+705 u oba stupca podataka. Dopušteno je odstupanje od 1kn zbog zaokruživanja.",null,0,0,{"$f":"IF(ABS(PRRAS!D718+PRRAS!D719-PRRAS!D209)>1,1,0)","v":0},{"$f":"IF(ABS(PRRAS!E718+PRRAS!E719-PRRAS!E209)>1,1,0)","v":0},null,null,null,null,null,null,null,null,null,null,null,null,27521]
[46,"O.K.","AOP 200 mora biti jednak zbroju AOP-a: 706 do 709 u oba stupca podataka. Dopušteno je odstupanje od 1kn zbog zaokruživanja.",null,0,0,{"$f":"IF(ABS(PRRAS!D211-SUM(PRRAS!D720:D723))>1,1,0)","v":0},{"$f":"IF(ABS(PRRAS!E211-SUM(PRRAS!E720:E723))>1,1,0)","v":0},null,null,null,null,null,null,null,null,null,null,null,null,27530]
[47,"O.K.","AOP 201 mora biti jednak zbroju AOP-a: 710 do 712 u oba stupca podataka. Dopušteno je odstupanje od 1kn zbog zaokruživanja.",null,0,0,{"$f":"IF(ABS(PRRAS!D212-SUM(PRRAS!D724:D726))>1,1,0)","v":0},{"$f":"IF(ABS(PRRAS!E212-SUM(PRRAS!E724:E726))>1,1,0)","v":0},null,null,null,null,null,null,null,null,null,null,null,null,27572]
[48,"O.K.","AOP 202 mora biti jednak zbroju AOP-a: 713 do 718 u oba stupca podataka. Dopušteno je odstupanje od 1kn zbog zaokruživanja.",null,0,0,{"$f":"IF(ABS(PRRAS!D213-SUM(PRRAS!D727:D732))>1,1,0)","v":0},{"$f":"IF(ABS(PRRAS!E213-SUM(PRRAS!E727:E732))>1,1,0)","v":0},null,null,null,null,null,null,null,null,null,null,null,null,27597]
[49,"O.K.","Zbroj AOP-a 719 do 721 je samo dio AOP-a 205 i mora biti manji ili jednak njemu u oba stupca podataka",null,0,0,{"$f":"IF(SUM(PRRAS!D733:D735)>PRRAS!D216,1,0)","v":0},{"$f":"IF(SUM(PRRAS!E733:E735)>PRRAS!E216,1,0)","v":0},null,null,null,null,null,null,null,null,null,null,null,null,27716]
[50,"O.K.","AOP 206 mora biti jednak zbroju AOP-a: 722 do 728 u oba stupca podataka. Dopušteno je odstupanje od 1kn zbog zaokruživanja.",null,0,0,{"$f":"IF(ABS(PRRAS!D217-SUM(PRRAS!D736:D742))>1,1,0)","v":0},{"$f":"IF(ABS(PRRAS!E217-SUM(PRRAS!E736:E742))>1,1,0)","v":0},null,null,null,null,null,null,null,null,null,null,null,null,27804]
[51,"O.K.","AOP 729 je samo dio AOP-a 211 i mora biti manji ili jednak njemu u oba stupca podataka",null,0,0,{"$f":"IF(PRRAS!D743>PRRAS!D222,1,0)","v":0},{"$f":"IF(PRRAS!E743>PRRAS!E222,1,0)","v":0},null,null,null,null,null,null,null,null,null,null,null,null,27888]
[52,"O.K.","AOP 219 mora biti jednak zbroju AOP-a: 730+731 u oba stupca podataka. Dopušteno je odstupanje od 1kn zbog zaokruživanja.",null,0,0,{"$f":"IF(ABS(PRRAS!D230-PRRAS!D744-PRRAS!D745)>1,1,0)","v":0},{"$f":"IF(ABS(PRRAS!E230-PRRAS!E744-PRRAS!E745)>1,1,0)","v":0},null,null,null,null,null,null,null,null,null,null,null,null,27907]
[53,"O.K.","AOP 229 mora biti jednak zbroju AOP-a: 732 do 738 u oba stupca podataka. Dopušteno je odstupanje od 1kn zbog zaokruživanja.",null,0,0,{"$f":"IF(ABS(PRRAS!D240-SUM(PRRAS!D746:D752))>1,1,0)","v":0},{"$f":"IF(ABS(PRRAS!E240-SUM(PRRAS!E746:E752))>1,1,0)","v":0},null,null,null,null,null,null,null,null,null,null,null,null,27931]
[54,"O.K.","AOP 230 mora biti jednak zbroju AOP-a: 739 do 745 u oba stupca podataka. Dopušteno je odstupanje od 1kn zbog zaokruživanja.",null,0,0,{"$f":"IF(ABS(PRRAS!D241-SUM(PRRAS!D753:D759))>1,1,0)","v":0},{"$f":"IF(ABS(PRRAS!E241-SUM(PRRAS!E753:E759))>1,1,0)","v":0},null,null,null,null,null,null,null,null,null,null,null,null,28006]
[55,"O.K.","AOP 239 mora biti jednak zbroju AOP-a: 746 do 754 u oba stupca podataka. Dopušteno je odstupanje od 1kn zbog zaokruživanja.",null,0,0,{"$f":"IF(ABS(PRRAS!D250-SUM(PRRAS!D760:D768))>1,1,0)","v":0},{"$f":"IF(ABS(PRRAS!E250-SUM(PRRAS!E760:E768))>1,1,0)","v":0},null,null,null,null,null,null,null,null,null,null,null,null,28014]
[56,"O.K.","AOP 240 mora biti jednak zbroju AOP-a: 755 do 763 u oba stupca podataka. Dopušteno je odstupanje od 1kn zbog zaokruživanja.",null,0,0,{"$f":"IF(ABS(PRRAS!D251-SUM(PRRAS!D769:D777))>1,1,0)","v":0},{"$f":"IF(ABS(PRRAS!E251-SUM(PRRAS!E769:E777))>1,1,0)","v":0},null,null,null,null,null,null,null,null,null,null,null,null,28143]
[57,"O.K.","AOP 250 mora biti jednak zbroju AOP-a: 764 do 766 u oba stupca podataka. Dopušteno je odstupanje od 1kn zbog zaokruživanja.",null,0,0,{"$f":"IF(ABS(PRRAS!D261-SUM(PRRAS!D778:D780))>1,1,0)","v":0},{"$f":"IF(ABS(PRRAS!E261-SUM(PRRAS!E778:E780))>1,1,0)","v":0},null,null,null,null,null,null,null,null,null,null,null,null,28151]
[58,"O.K.","AOP 251 mora biti jednak zbroju AOP-a: 767 do 770 u oba stupca podataka. Dopušteno je odstupanje od 1kn zbog zaokruživanja.",null,0,0,{"$f":"IF(ABS(PRRAS!D262-SUM(PRRAS!D781:D784))>1,1,0)","v":0},{"$f":"IF(ABS(PRRAS!E262-SUM(PRRAS!E781:E784))>1,1,0)","v":0},null,null,null,null,null,null,null,null,null,null,null,null,28160]
[59,"O.K.","AOP 254 mora biti jednak zbroju AOP-a: 771 do 779 u oba stupca podataka. Dopušteno je odstupanje od 1kn zbog zaokruživanja.",null,0,0,{"$f":"IF(ABS(PRRAS!D265-SUM(PRRAS!D785:D793))>1,1,0)","v":0},{"$f":"IF(ABS(PRRAS!E265-SUM(PRRAS!E785:E793))>1,1,0)","v":0},null,null,null,null,null,null,null,null,null,null,null,null,28178]
[60,"O.K.","AOP 255 mora biti jednak zbroju AOP-a: 780 do 784 u oba stupca podataka. Dopušteno je odstupanje od 1kn zbog zaokruživanja.",null,0,0,{"$f":"IF(ABS(PRRAS!D266-SUM(PRRAS!D794:D798))>1,1,0)","v":0},{"$f":"IF(ABS(PRRAS!E266-SUM(PRRAS!E794:E798))>1,1,0)","v":0},null,null,null,null,null,null,null,null,null,null,null,null,28186]
[61,"O.K.","AOP 785 je samo dio AOP-a 259 i mora biti manji ili jednak njemu u oba stupca podataka",null,0,0,{"$f":"IF(PRRAS!D799>PRRAS!D270,1,0)","v":0},{"$f":"IF(PRRAS!E799>PRRAS!E270,1,0)","v":0},null,null,null,null,null,null,null,null,null,null,null,null,28194]
[62,"O.K.","AOP 273 mora biti jednak zbroju AOP-a: 786 do 789 u oba stupca podataka. Dopušteno je odstupanje od 1kn zbog zaokruživanja.",null,0,0,{"$f":"IF(ABS(PRRAS!D284-SUM(PRRAS!D800:D803))>1,1,0)","v":0},{"$f":"IF(ABS(PRRAS!E284-SUM(PRRAS!E800:E803))>1,1,0)","v":0},null,null,null,null,null,null,null,null,null,null,null,null,28284]
[63,"O.K.","AOP 274 mora biti jednak zbroju AOP-a: 790 do 794 u oba stupca podataka. Dopušteno je odstupanje od 1kn zbog zaokruživanja.",null,0,0,{"$f":"IF(ABS(PRRAS!D285-SUM(PRRAS!D804:D808))>1,1,0)","v":0},{"$f":"IF(ABS(PRRAS!E285-SUM(PRRAS!E804:E808))>1,1,0)","v":0},null,null,null,null,null,null,null,null,null,null,null,null,28330]
[64,"O.K.","AOP 275 mora biti jednak zbroju AOP-a: 795+796 u oba stupca podataka. Dopušteno je odstupanje od 1kn zbog zaokruživanja.",null,0,0,{"$f":"IF(ABS(PRRAS!D286-SUM(PRRAS!D809:D810))>1,1,0)","v":0},{"$f":"IF(ABS(PRRAS!E286-SUM(PRRAS!E809:E810))>1,1,0)","v":0},null,null,null,null,null,null,null,null,null,null,null,null,28348]
[65,"O.K.","AOP 276 mora biti jednak zbroju AOP-a: 797+798 u oba stupca podataka. Dopušteno je odstupanje od 1kn zbog zaokruživanja.",null,{"$f":"MAX(G71:L71)","v":0},0,{"$f":"IF(ABS(PRRAS!D287-SUM(PRRAS!D811:D812))>1,1,0)","v":0},{"$f":"IF(ABS(PRRAS!E287-SUM(PRRAS!E811:E812))>1,1,0)","v":0},null,null,null,null,null,null,null,null,null,null,null,null,28356]
[66,"O.K.","Zbroj AOP-a: 799+800 je samo dio AOP-a 418 i mora biti manji ili jednak njemu u oba stupca podataka",null,0,0,{"$f":"IF(PRRAS!D813+PRRAS!D814>PRRAS!D431,1,0)","v":0},{"$f":"IF(PRRAS!E813+PRRAS!E814>PRRAS!E431,1,0)","v":0},null,null,null,null,null,null,null,null,null,null,null,null,28364]
[67,{"$f":"IF(E73=1,\"Pogreška\",IF(F73=1,\"Provjera\",\"O.K.\"))","v":"O.K."},"Zbroj AOP-a: 801+801 je samo dio AOP-a 421 i mora biti manji ili jednak njemu u oba stupca podataka",null,0,0,{"$f":"IF(PRRAS!D815+PRRAS!D816>PRRAS!D434,1,0)","v":0},{"$f":"IF(PRRAS!E815+PRRAS!E816>PRRAS!E434,1,0)","v":0},null,null,null,null,null,null,null,null,null,null,null,null,28397]
[68,"O.K.","Zbroj AOP-a: 803+804 je samo dio AOP-a 422 i mora biti manji ili jednak njemu u oba stupca podataka",null,0,0,{"$f":"IF(PRRAS!D817+PRRAS!D818>PRRAS!D435,1,0)","v":0},{"$f":"IF(PRRAS!E817+PRRAS!E818>PRRAS!E435,1,0)","v":0},null,null,null,null,null,null,null,null,null,null,null,null,28573]
[69,"O.K.","Zbroj AOP-a: 805+806 je samo dio AOP-a 423 i mora biti manji ili jednak njemu u oba stupca podataka",null,0,0,{"$f":"IF(PRRAS!D819+PRRAS!D820>PRRAS!D436,1,0)","v":0},{"$f":"IF(PRRAS!E819+PRRAS!E820>PRRAS!E436,1,0)","v":0},null,null,null,null,null,null,null,null,null,null,null,null,28637]
[70,"O.K.","AOP 424 mora biti jednak zbroju AOP-a 807 do 809 u oba stupca podataka. Dopušteno je odstupanje od 1 kn zbog zaokruživanja",null,0,0,{"$f":"IF(ABS(PRRAS!D437-SUM(PRRAS!D821:D823))>1,1,0)","v":0},{"$f":"IF(ABS(PRRAS!E437-SUM(PRRAS!E821:E823))>1,1,0)","v":0},null,null,null,null,null,null,null,null,null,null,null,null,28670]
[71,"O.K.","Zbroj AOP-a: 810+811 je samo dio AOP-a 426 i mora biti manji ili jednak njemu u oba stupca podataka",null,0,0,{"$f":"IF(PRRAS!D824+PRRAS!D825>PRRAS!D439,1,0)","v":0},{"$f":"IF(PRRAS!E824+PRRAS!E825>PRRAS!E439,1,0)","v":0},null,null,null,null,null,null,null,null,null,null,null,null,28707]
[72,"O.K.","Zbroj AOP-a: 812+813 je samo dio AOP-a 427 i mora biti manji ili jednak njemu u oba stupca podataka",null,0,0,{"$f":"IF(PRRAS!D826+PRRAS!D827>PRRAS!D440,1,0)","v":0},{"$f":"IF(PRRAS!E826+PRRAS!E827>PRRAS!E440,1,0)","v":0},null,null,null,null,null,null,null,null,null,null,null,null,28959]
[73,"O.K.","Zbroj AOP-a: 814+815 je samo dio AOP-a 428 i mora biti manji ili jednak njemu u oba stupca podataka",null,0,0,{"$f":"IF(PRRAS!D828+PRRAS!D829>PRRAS!D441,1,0)","v":0},{"$f":"IF(PRRAS!E828+PRRAS!E829>PRRAS!E441,1,0)","v":0},null,null,null,null,null,null,null,null,null,null,null,null,29285]
[74,"O.K.","AOP 433 mora biti jednak zbroju AOP-a: 816 do 818 u oba stupca podataka. Dopušteno je odstupanje od 1 kn zbog zaokruživanja",null,0,0,{"$f":"IF(ABS(PRRAS!D446-SUM(PRRAS!D830:D832))>1,1,0)","v":0},{"$f":"IF(ABS(PRRAS!E446-SUM(PRRAS!E830:E832))>1,1,0)","v":0},null,null,null,null,null,null,null,null,null,null,null,null,29293]
[75,"O.K.","AOP 433 mora biti jednak zbroju AOP-a: 819 do 821 u oba stupca podataka. Dopušteno je odstupanje od 1 kn zbog zaokruživanja",null,0,0,{"$f":"IF(ABS(PRRAS!D447-SUM(PRRAS!D833:D835))>1,1,0)","v":0},{"$f":"IF(ABS(PRRAS!E447-SUM(PRRAS!E833:E835))>1,1,0)","v":0},null,null,null,null,null,null,null,null,null,null,null,null,29308]
[76,"O.K.","AOP 438 mora biti jednak zbroju AOP-a: 822+823 u oba stupca podataka. Dopušteno je odstupanje od 1 kn zbog zaokruživanja",null,0,0,{"$f":"IF(ABS(PRRAS!D451-SUM(PRRAS!D836:D837))>1,1,0)","v":0},{"$f":"IF(ABS(PRRAS!E451-SUM(PRRAS!E836:E837))>1,1,0)","v":0},null,null,null,null,null,null,null,null,null,null,null,null,29316]
[77,"O.K.","AOP 439 mora biti jednak zbroju AOP-a: 824 do 826 u oba stupca podataka. Dopušteno je odstupanje od 1 kn zbog zaokruživanja",null,0,0,{"$f":"IF(ABS(PRRAS!D452-SUM(PRRAS!D838:D840))>1,1,0)","v":0},{"$f":"IF(ABS(PRRAS!E452-SUM(PRRAS!E838:E840))>1,1,0)","v":0},null,null,null,null,null,null,null,null,null,null,null,null,29531]
[78,"O.K.","AOP 440 mora biti jednak zbroju AOP-a: 827 do 829 u oba stupca podataka. Dopušteno je odstupanje od 1 kn zbog zaokruživanja",null,0,0,{"$f":"IF(ABS(PRRAS!D453-SUM(PRRAS!D841:D843))>1,1,0)","v":0},{"$f":"IF(ABS(PRRAS!E453-SUM(PRRAS!E841:E843))>1,1,0)","v":0},null,null,null,null,null,null,null,null,null,null,null,null,29566]
[79,"O.K.","AOP 441 mora biti jednak zbroju AOP-a: 830 do 832 u oba stupca podataka. Dopušteno je odstupanje od 1 kn zbog zaokruživanja",null,0,0,{"$f":"IF(ABS(PRRAS!D454-SUM(PRRAS!D844:D846))>1,1,0)","v":0},{"$f":"IF(ABS(PRRAS!E454-SUM(PRRAS!E844:E846))>1,1,0)","v":0},null,null,null,null,null,null,null,null,null,null,null,null,29927]
[80,"O.K.","AOP 442 mora biti jednak zbroju AOP-a: 833 do 835 u oba stupca podataka. Dopušteno je odstupanje od 1 kn zbog zaokruživanja",null,0,0,{"$f":"IF(ABS(PRRAS!D455-SUM(PRRAS!D847:D849))>1,1,0)","v":0},{"$f":"IF(ABS(PRRAS!E455-SUM(PRRAS!E847:E849))>1,1,0)","v":0},null,null,null,null,null,null,null,null,null,null,null,null,29943]
[81,"O.K.","AOP 443 mora biti jednak zbroju AOP-a: 836 do 838 u oba stupca podataka. Dopušteno je odstupanje od 1 kn zbog zaokruživanja",null,0,0,{"$f":"IF(ABS(PRRAS!D456-SUM(PRRAS!D850:D852))>1,1,0)","v":0},{"$f":"IF(ABS(PRRAS!E456-SUM(PRRAS!E850:E852))>1,1,0)","v":0},null,null,null,null,null,null,null,null,null,null,null,null,30099]
[82,"O.K.","AOP 444 mora biti jednak zbroju AOP-a: 839 do 841 u oba stupca podataka. Dopušteno je odstupanje od 1 kn zbog zaokruživanja",null,0,0,{"$f":"IF(ABS(PRRAS!D457-SUM(PRRAS!D853:D855))>1,1,0)","v":0},{"$f":"IF(ABS(PRRAS!E457-SUM(PRRAS!E853:E855))>1,1,0)","v":0},null,null,null,null,null,null,null,null,null,null,null,null,30103]
[83,"O.K.","AOP 842 je samo dio AOP-a 460 i mora biti manji ili jednak njemu u oba stupca podataka",null,0,0,{"$f":"IF(PRRAS!D856>PRRAS!D473,1,0)","v":0},{"$f":"IF(PRRAS!E856>PRRAS!E473,1,0)","v":0},null,null,null,null,null,null,null,null,null,null,null,null,30111]
[84,"O.K.","AOP 843 je samo dio AOP-a 476 i mora biti manji ili jednak njemu u oba stupca podataka",null,0,0,{"$f":"IF(PRRAS!D857>PRRAS!D489,1,0)","v":0},{"$f":"IF(PRRAS!E857>PRRAS!E489,1,0)","v":0},null,null,null,null,null,null,null,null,null,null,null,null,30120]
[85,"O.K.","AOP 844 je samo dio AOP-a 477 i mora biti manji ili jednak njemu u oba stupca podataka",null,0,0,{"$f":"IF(PRRAS!D858>PRRAS!D490,1,0)","v":0},{"$f":"IF(PRRAS!E858>PRRAS!E490,1,0)","v":0},null,null,null,null,null,null,null,null,null,null,null,null,30138]
[86,"O.K.","AOP 845 je samo dio AOP-a 478 i mora biti manji ili jednak njemu u oba stupca podataka",null,0,0,{"$f":"IF(PRRAS!D859>PRRAS!D491,1,0)","v":0},{"$f":"IF(PRRAS!E859>PRRAS!E491,1,0)","v":0},null,null,null,null,null,null,null,null,null,null,null,null,30339]
[87,"O.K.","AOP 846 je samo dio AOP-a 479 i mora biti manji ili jednak njemu u oba stupca podataka",null,0,0,{"$f":"IF(PRRAS!D860>PRRAS!D492,1,0)","v":0},{"$f":"IF(PRRAS!E860>PRRAS!E492,1,0)","v":0},null,null,null,null,null,null,null,null,null,null,null,null,30371]
[88,"O.K.","Zbroj AOP-a: 847 do 849 je samo dio AOP-a 481 i mora biti manji ili jednak njemu u oba stupca podataka",null,0,0,{"$f":"IF(SUM(PRRAS!D861:D863)>PRRAS!D494,1,0)","v":0},{"$f":"IF(SUM(PRRAS!E861:E863)>PRRAS!E494,1,0)","v":0},null,null,null,null,null,null,null,null,null,null,null,null,30402]
[89,"O.K.","AOP 850 je samo dio AOP-a 482 i mora biti manji ili jednak njemu u oba stupca podataka",null,0,0,{"$f":"IF(PRRAS!D864>PRRAS!D495,1,0)","v":0},{"$f":"IF(PRRAS!E864>PRRAS!E495,1,0)","v":0},null,null,null,null,null,null,null,null,null,null,null,null,30451]
[90,"O.K.","Zbroj AOP-a: 851+852 je samo dio AOP-a 483 i mora biti manji ili jednak njemu u oba stupca podataka",null,0,0,{"$f":"IF(SUM(PRRAS!D865:D866)>PRRAS!D496,1,0)","v":0},{"$f":"IF(SUM(PRRAS!E865:E866)>PRRAS!E496,1,0)","v":0},null,null,null,null,null,null,null,null,null,null,null,null,30525]
[91,"O.K.","AOP 853 je samo dio AOP-a 484 i mora biti manji ili jednak njemu u oba stupca podataka",null,0,0,{"$f":"IF(PRRAS!D867>PRRAS!D497,1,0)","v":0},{"$f":"IF(PRRAS!E867>PRRAS!E497,1,0)","v":0},null,null,null,null,null,null,null,null,null,null,null,null,30630]
[92,"O.K.","Zbroj AOP-a: 854 do 856 je samo dio AOP-a 486 i mora biti manji ili jednak njemu u oba stupca podataka",null,{"$f":"MAX(G98:L98)","v":0},0,{"$f":"IF(SUM(PRRAS!D868:D870)>PRRAS!D499,1,0)","v":0},{"$f":"IF(SUM(PRRAS!E868:E870)>PRRAS!E499,1,0)","v":0},null,null,null,null,null,null,null,null,null,null,null,null,30832]
[93,"O.K.","AOP 857 je samo dio AOP-a 487 i mora biti manji ili jednak njemu u oba stupca podataka",null,0,0,{"$f":"IF(PRRAS!D871>PRRAS!D500,1,0)","v":0},{"$f":"IF(PRRAS!E871>PRRAS!E500,1,0)","v":0},null,null,null,null,null,null,null,null,null,null,null,null,30849]
[94,"O.K.","Zbroj AOP-a: 858+859 je samo dio AOP-a 488 i mora biti manji ili jednak njemu u oba stupca podataka",null,0,0,{"$f":"IF(SUM(PRRAS!D872:D873)>PRRAS!D501,1,0)","v":0},{"$f":"IF(SUM(PRRAS!E872:E873)>PRRAS!E501,1,0)","v":0},null,null,null,null,null,null,null,null,null,null,null,null,30865]
[95,"O.K.","Zbroj AOP-a: 860 do 862 je samo dio AOP-a 489 i mora biti manji ili jednak njemu u oba stupca podataka",null,0,0,{"$f":"IF(SUM(PRRAS!D874:D876)>PRRAS!D502,1,0)","v":0},{"$f":"IF(SUM(PRRAS!E874:E876)>PRRAS!E502,1,0)","v":0},null,null,null,null,null,null,null,null,null,null,null,null,30912]
[96,"O.K.","AOP 863 je samo dio AOP-a 490 i mora biti manji ili jednak njemu u oba stupca podataka",null,0,0,{"$f":"IF(PRRAS!D877>PRRAS!D503,1,0)","v":0},{"$f":"IF(PRRAS!E877>PRRAS!E503,1,0)","v":0},null,null,null,null,null,null,null,null,null,null,null,null,30929]
[97,"O.K.","Zbroj AOP-a: 864+865 je samo dio AOP-a 491 i mora biti manji ili jednak njemu u oba stupca podataka",null,0,0,{"$f":"IF(SUM(PRRAS!D878:D879)>PRRAS!D504,1,0)","v":0},{"$f":"IF(SUM(PRRAS!E878:E879)>PRRAS!E504,1,0)","v":0},null,null,null,null,null,null,null,null,null,null,null,null,30953]
[98,"O.K.","AOP 866 je samo dio AOP-a 493 i mora biti manji ili jednak njemu u oba stupca podataka",null,0,0,{"$f":"IF(PRRAS!D880>PRRAS!D506,1,0)","v":0},{"$f":"IF(PRRAS!E880>PRRAS!E506,1,0)","v":0},null,null,null,null,null,null,null,null,null,null,null,null,31042]
[99,"O.K.","AOP 867 je samo dio AOP-a 494 i mora biti manji ili jednak njemu u oba stupca podataka",null,0,0,{"$f":"IF(PRRAS!D881>PRRAS!D507,1,0)","v":0},{"$f":"IF(PRRAS!E881>PRRAS!E507,1,0)","v":0},null,null,null,null,null,null,null,null,null,null,null,null,31147]
[100,"O.K.","AOP 868 je samo dio AOP-a 495 i mora biti manji ili jednak njemu u oba stupca podataka",null,0,0,{"$f":"IF(PRRAS!D882>PRRAS!D508,1,0)","v":0},{"$f":"IF(PRRAS!E882>PRRAS!E508,1,0)","v":0},null,null,null,null,null,null,null,null,null,null,null,null,31202]
[101,"O.K.","AOP 498 mora biti jednak zbroju AOP-a: 869+870 u oba stupca podataka. Dopušteno je odstupanje od 1kn zbog zaokruživanja.",null,0,0,{"$f":"IF(ABS(PRRAS!D511-PRRAS!D883-PRRAS!D884)>1,1,0)","v":0},{"$f":"IF(ABS(PRRAS!E511-PRRAS!E883-PRRAS!E884)>1,1,0)","v":0},null,null,null,null,null,null,null,null,null,null,null,null,31278]
[102,"O.K.","AOP 499 mora biti jednak zbroju AOP-a: 871+872 u oba stupca podataka. Dopušteno je odstupanje od 1kn zbog zaokruživanja.",null,0,0,{"$f":"IF(ABS(PRRAS!D512-PRRAS!D885-PRRAS!D886)>1,1,0)","v":0},{"$f":"IF(ABS(PRRAS!E512-PRRAS!E885-PRRAS!E886)>1,1,0)","v":0},null,null,null,null,null,null,null,null,null,null,null,null,31286]
[103,"O.K.","AOP 500 mora biti jednak zbroju AOP-a: 873+874 u oba stupca podataka. Dopušteno je odstupanje od 1kn zbog zaokruživanja.",null,0,0,{"$f":"IF(ABS(PRRAS!D513-PRRAS!D887-PRRAS!D888)>1,1,0)","v":0},{"$f":"IF(ABS(PRRAS!E513-PRRAS!E887-PRRAS!E888)>1,1,0)","v":0},null,null,null,null,null,null,null,null,null,null,null,null,31317]
[104,"O.K.","AOP 501 mora biti jednak zbroju AOP-a: 875+876 u oba stupca podataka. Dopušteno je odstupanje od 1kn zbog zaokruživanja.",null,0,0,{"$f":"IF(ABS(PRRAS!D514-PRRAS!D889-PRRAS!D890)>1,1,0)","v":0},{"$f":"IF(ABS(PRRAS!E514-PRRAS!E889-PRRAS!E890)>1,1,0)","v":0},null,null,null,null,null,null,null,null,null,null,null,null,31413]
[105,"O.K.","AOP 502 mora biti jednak zbroju AOP-a: 877+878 u oba stupca podataka. Dopušteno je odstupanje od 1kn zbog zaokruživanja.",null,0,0,{"$f":"IF(ABS(PRRAS!D515-PRRAS!D891-PRRAS!D892)>1,1,0)","v":0},{"$f":"IF(ABS(PRRAS!E515-PRRAS!E891-PRRAS!E892)>1,1,0)","v":0},null,null,null,null,null,null,null,null,null,null,null,null,31421]
[106,"O.K.","AOP 503 mora biti jednak zbroju AOP-a: 879+880 u oba stupca podataka. Dopušteno je odstupanje od 1kn zbog zaokruživanja.",null,0,0,{"$f":"IF(ABS(PRRAS!D516-PRRAS!D893-PRRAS!D894)>1,1,0)","v":0},{"$f":"IF(ABS(PRRAS!E516-PRRAS!E893-PRRAS!E894)>1,1,0)","v":0},null,null,null,null,null,null,null,null,null,null,null,null,31430]
[107,"O.K.","AOP 504 mora biti jednak zbroju AOP-a: 881+882 u oba stupca podataka. Dopušteno je odstupanje od 1kn zbog zaokruživanja.",null,0,0,{"$f":"IF(ABS(PRRAS!D517-PRRAS!D895-PRRAS!D896)>1,1,0)","v":0},{"$f":"IF(ABS(PRRAS!E517-PRRAS!E895-PRRAS!E896)>1,1,0)","v":0},null,null,null,null,null,null,null,null,null,null,null,null,31448]
[108,"O.K.","AOP 883 je samo dio AOP-a 516 i mora biti manji ili jednak njemu u oba stupca podataka",null,0,0,{"$f":"IF(PRRAS!D897>PRRAS!D529,1,0)","v":0},{"$f":"IF(PRRAS!E897>PRRAS!E529,1,0)","v":0},null,null,null,null,null,null,null,null,null,null,null,null,31456]
[109,"O.K.","Zbroj AOP-a: 884+885 je samo dio AOP-a 526 i mora biti manji ili jednak njemu u oba stupca podataka",null,0,0,{"$f":"IF(PRRAS!D898+PRRAS!D899>PRRAS!D539,1,0)","v":0},{"$f":"IF(PRRAS!E898+PRRAS!E899>PRRAS!E539,1,0)","v":0},null,null,null,null,null,null,null,null,null,null,null,null,31497]
[110,"O.K.","Zbroj AOP-a: 886+887 je samo dio AOP-a 529 i mora biti manji ili jednak njemu u oba stupca podataka",null,0,0,{"$f":"IF(PRRAS!D900+PRRAS!D901>PRRAS!D542,1,0)","v":0},{"$f":"IF(PRRAS!E900+PRRAS!E901>PRRAS!E542,1,0)","v":0},null,null,null,null,null,null,null,null,null,null,null,null,31536]
[111,"O.K.","Zbroj AOP-a: 888+889 je samo dio AOP-a 530 i mora biti manji ili jednak njemu u oba stupca podataka",null,0,0,{"$f":"IF(PRRAS!D902+PRRAS!D903>PRRAS!D543,1,0)","v":0},{"$f":"IF(PRRAS!E902+PRRAS!E903>PRRAS!E543,1,0)","v":0},null,null,null,null,null,null,null,null,null,null,null,null,31729]
[112,"O.K.","Zbroj AOP-a: 890+891 je samo dio AOP-a 531 i mora biti manji ili jednak njemu u oba stupca podataka",null,0,0,{"$f":"IF(PRRAS!D904+PRRAS!D905>PRRAS!D544,1,0)","v":0},{"$f":"IF(PRRAS!E904+PRRAS!E905>PRRAS!E544,1,0)","v":0},null,null,null,null,null,null,null,null,null,null,null,null,31737]
[113,"O.K.","AOP 532 mora biti jednak zbroju AOP-a: 892 do 894 u oba stupca podataka. Dopušteno je odstupanje od 1kn zbog zaokruživanja.",null,0,0,{"$f":"IF(ABS(PRRAS!D545-SUM(PRRAS!D906:D908))>1,1,0)","v":0},{"$f":"IF(ABS(PRRAS!E545-SUM(PRRAS!E906:E908))>1,1,0)","v":0},null,null,null,null,null,null,null,null,null,null,null,null,31753]
[114,"O.K.","Zbroj AOP-a: 895+896 je samo dio AOP-a 534 i mora biti manji ili jednak njemu u oba stupca podataka",null,0,0,{"$f":"IF(SUM(PRRAS!D909:D910)>PRRAS!D547,1,0)","v":0},{"$f":"IF(SUM(PRRAS!E909:E910)>PRRAS!E547,1,0)","v":0},null,null,null,null,null,null,null,null,null,null,null,null,31761]
[115,"O.K.","Zbroj AOP-a: 897+898 je samo dio AOP-a 535 i mora biti manji ili jednak njemu u oba stupca podataka",null,0,0,{"$f":"IF(SUM(PRRAS!D911:D912)>PRRAS!D548,1,0)","v":0},{"$f":"IF(SUM(PRRAS!E911:E912)>PRRAS!E548,1,0)","v":0},null,null,null,null,null,null,null,null,null,null,null,null,31770]
[116,"O.K.","Zbroj AOP-a: 899+900 je samo dio AOP-a 536 i mora biti manji ili jednak njemu u oba stupca podataka",null,0,0,{"$f":"IF(SUM(PRRAS!D913:D914)>PRRAS!D549,1,0)","v":0},{"$f":"IF(SUM(PRRAS!E913:E914)>PRRAS!E549,1,0)","v":0},null,null,null,null,null,null,null,null,null,null,null,null,31788]
[117,"O.K.","AOP 541 mora biti jednak zbroju AOP-a: 900 do 903 u oba stupca podataka. Dopušteno je odstupanje od 1kn zbog zaokruživanja.",null,0,0,{"$f":"IF(ABS(PRRAS!D554-SUM(PRRAS!D915:D917))>1,1,0)","v":0},{"$f":"IF(ABS(PRRAS!E554-SUM(PRRAS!E915:E917))>1,1,0)","v":0},null,null,null,null,null,null,null,null,null,null,null,null,31796]
[118,"O.K.","AOP 542 mora biti jednak zbroju AOP-a: 904 do 906 u oba stupca podataka. Dopušteno je odstupanje od 1kn zbog zaokruživanja.",null,0,0,{"$f":"IF(ABS(PRRAS!D555-SUM(PRRAS!D918:D920))>1,1,0)","v":0},{"$f":"IF(ABS(PRRAS!E555-SUM(PRRAS!E918:E920))>1,1,0)","v":0},null,null,null,null,null,null,null,null,null,null,null,null,31920]
[119,"O.K.","AOP 546 mora biti jednak zbroju AOP-a: 907+908 u oba stupca podataka. Dopušteno je odstupanje od 1kn zbog zaokruživanja.",null,0,0,{"$f":"IF(ABS(PRRAS!D559-SUM(PRRAS!D921:D922))>1,1,0)","v":0},{"$f":"IF(ABS(PRRAS!E559-SUM(PRRAS!E921:E922))>1,1,0)","v":0},null,null,null,null,null,null,null,null,null,null,null,null,31995]
[120,"O.K.","AOP 547 mora biti jednak zbroju AOP-a: 909 do 911 u oba stupca podataka. Dopušteno je odstupanje od 1kn zbog zaokruživanja.",null,0,0,{"$f":"IF(ABS(PRRAS!D560-SUM(PRRAS!D923:D925))>1,1,0)","v":0},{"$f":"IF(ABS(PRRAS!E560-SUM(PRRAS!E923:E925))>1,1,0)","v":0},null,null,null,null,null,null,null,null,null,null,null,null,32002]
[121,"O.K.","AOP 548 mora biti jednak zbroju AOP-a: 912 do 914 u oba stupca podataka. Dopušteno je odstupanje od 1kn zbog zaokruživanja.",null,0,0,{"$f":"IF(ABS(PRRAS!D561-SUM(PRRAS!D926:D928))>1,1,0)","v":0},{"$f":"IF(ABS(PRRAS!E561-SUM(PRRAS!E926:E928))>1,1,0)","v":0},null,null,null,null,null,null,null,null,null,null,null,null,32133]
[122,"O.K.","AOP 549 mora biti jednak zbroju AOP-a: 915 do 917 u oba stupca podataka. Dopušteno je odstupanje od 1kn zbog zaokruživanja.",null,0,0,{"$f":"IF(ABS(PRRAS!D562-SUM(PRRAS!D929:D931))>1,1,0)","v":0},{"$f":"IF(ABS(PRRAS!E562-SUM(PRRAS!E929:E931))>1,1,0)","v":0},null,null,null,null,null,null,null,null,null,null,null,null,32168]
[123,"O.K.","AOP 550 mora biti jednak zbroju AOP-a: 918 do 920 u oba stupca podataka. Dopušteno je odstupanje od 1kn zbog zaokruživanja.",null,0,0,{"$f":"IF(ABS(PRRAS!D563-SUM(PRRAS!D932:D934))>1,1,0)","v":0},{"$f":"IF(ABS(PRRAS!E563-SUM(PRRAS!E932:E934))>1,1,0)","v":0},null,null,null,null,null,null,null,null,null,null,null,null,32176]
[124,"O.K.","AOP 551 mora biti jednak zbroju AOP-a: 921 do 923 u oba stupca podataka. Dopušteno je odstupanje od 1kn zbog zaokruživanja.",null,0,0,{"$f":"IF(ABS(PRRAS!D564-SUM(PRRAS!D935:D937))>1,1,0)","v":0},{"$f":"IF(ABS(PRRAS!E564-SUM(PRRAS!E935:E937))>1,1,0)","v":0},null,null,null,null,null,null,null,null,null,null,null,null,32184]
[125,"O.K.","AOP 552 mora biti jednak zbroju AOP-a: 924 do 926 u oba stupca podataka. Dopušteno je odstupanje od 1kn zbog zaokruživanja.",null,0,0,{"$f":"IF(ABS(PRRAS!D565-SUM(PRRAS!D938:D940))>1,1,0)","v":0},{"$f":"IF(ABS(PRRAS!E565-SUM(PRRAS!E938:E940))>1,1,0)","v":0},null,null,null,null,null,null,null,null,null,null,null,null,32221]
[126,"O.K.","AOP 927 je samo dio AOP-a 585 i mora biti manji ili jednak njemu u oba stupca podataka",null,0,0,{"$f":"IF(PRRAS!D941>PRRAS!D598,1,0)","v":0},{"$f":"IF(PRRAS!E941>PRRAS!E598,1,0)","v":0},null,null,null,null,null,null,null,null,null,null,null,null,32272]
[127,"O.K.","AOP 928 je samo dio AOP-a 586 i mora biti manji ili jednak njemu u oba stupca podataka",null,0,0,{"$f":"IF(PRRAS!D942>PRRAS!D599,1,0)","v":0},{"$f":"IF(PRRAS!E942>PRRAS!E599,1,0)","v":0},null,null,null,null,null,null,null,null,null,null,null,null,32490]
[128,"O.K.","AOP 929 je samo dio AOP-a 587 i mora biti manji ili jednak njemu u oba stupca podataka",null,0,0,{"$f":"IF(PRRAS!D943>PRRAS!D600,1,0)","v":0},{"$f":"IF(PRRAS!E943>PRRAS!E600,1,0)","v":0},null,null,null,null,null,null,null,null,null,null,null,null,32504]
[129,"O.K.","AOP 930 je samo dio AOP-a 588 i mora biti manji ili jednak njemu u oba stupca podataka",null,0,0,{"$f":"IF(PRRAS!D944>PRRAS!D601,1,0)","v":0},{"$f":"IF(PRRAS!E944>PRRAS!E601,1,0)","v":0},null,null,null,null,null,null,null,null,null,null,null,null,32529]
[130,"O.K.","Zbroj AOP-a: 931 do 933 je samo dio AOP-a 590 i mora biti manji ili jednak njemu u oba stupca podataka",null,0,0,{"$f":"IF(SUM(PRRAS!D945:D947)>PRRAS!D603,1,0)","v":0},{"$f":"IF(SUM(PRRAS!E945:E947)>PRRAS!E603,1,0)","v":0},null,null,null,null,null,null,null,null,null,null,null,null,32553]
[131,{"$f":"IF(E137=1,\"Pogreška\",IF(F137=1,\"Provjera\",\"O.K.\"))","v":"O.K."},"AOP 934 je samo dio AOP-a 591 i mora biti manji ili jednak njemu u oba stupca podataka",null,0,0,{"$f":"IF(PRRAS!D948>PRRAS!D604,1,0)","v":0},{"$f":"IF(PRRAS!E948>PRRAS!E604,1,0)","v":0},null,null,null,null,null,null,null,null,null,null,null,null,32615]
[132,"O.K.","Zbroj AOP-a: 935+936 je samo dio AOP-a 592 i mora biti manji ili jednak njemu u oba stupca podataka",null,0,0,{"$f":"IF(PRRAS!D949+PRRAS!D950>PRRAS!D605,1,0)","v":0},{"$f":"IF(PRRAS!E949+PRRAS!E950>PRRAS!E605,1,0)","v":0},null,null,null,null,null,null,null,null,null,null,null,null,32867]
[133,"O.K.","AOP 937 je samo dio AOP-a 593 i mora biti manji ili jednak njemu u oba stupca podataka",null,0,0,{"$f":"IF(PRRAS!D951>PRRAS!D606,1,0)","v":0},{"$f":"IF(PRRAS!E951>PRRAS!E606,1,0)","v":0},null,null,null,null,null,null,null,null,null,null,null,null,32875]
[134,"O.K.","Zbroj AOP-a: 938 do 940 je samo dio AOP-a 596 i mora biti manji ili jednak njemu u oba stupca podataka",null,0,0,{"$f":"IF(SUM(PRRAS!D952:D954)>PRRAS!D609,1,0)","v":0},{"$f":"IF(SUM(PRRAS!E952:E954)>PRRAS!E609,1,0)","v":0},null,null,null,null,null,null,null,null,null,null,null,null,32980]
[135,"O.K.","AOP 941 je samo dio AOP-a 597 i mora biti manji ili jednak njemu u oba stupca podataka",null,0,0,{"$f":"IF(PRRAS!D955>PRRAS!D610,1,0)","v":0},{"$f":"IF(PRRAS!E955>PRRAS!E610,1,0)","v":0},null,null,null,null,null,null,null,null,null,null,null,null,32998]
[136,"O.K.","Zbroj AOP-a: 942+943 je samo dio AOP-a 598 i mora biti manji ili jednak njemu u oba stupca podataka",null,0,0,{"$f":"IF(SUM(PRRAS!D956:D957)>PRRAS!D611,1,0)","v":0},{"$f":"IF(SUM(PRRAS!E956:E957)>PRRAS!E611,1,0)","v":0},null,null,null,null,null,null,null,null,null,null,null,null,33005]
[137,"O.K.","Zbroj AOP-a: 944 do 946 je samo dio AOP-a 599 i mora biti manji ili jednak njemu u oba stupca podataka",null,0,0,{"$f":"IF(SUM(PRRAS!D958:D960)>PRRAS!D612,1,0)","v":0},{"$f":"IF(SUM(PRRAS!E958:E960)>PRRAS!E612,1,0)","v":0},null,null,null,null,null,null,null,null,null,null,null,null,33013]
[138,"O.K.","AOP 947 je samo dio AOP-a 600 i mora biti manji ili jednak njemu u oba stupca podataka",null,0,0,{"$f":"IF(PRRAS!D961>PRRAS!D613,1,0)","v":0},{"$f":"IF(PRRAS!E961>PRRAS!E613,1,0)","v":0},null,null,null,null,null,null,null,null,null,null,null,null,33021]
[139,"O.K.","Zbroj AOP-a: 948+949 je samo dio AOP-a 601 i mora biti manji ili jednak njemu u oba stupca podataka",null,0,0,{"$f":"IF(SUM(PRRAS!D962:D963)>PRRAS!D614,1,0)","v":0},{"$f":"IF(SUM(PRRAS!E962:E963)>PRRAS!E614,1,0)","v":0},null,null,null,null,null,null,null,null,null,null,null,null,33030]
[140,"O.K.","AOP 950 je samo dio AOP-a 603 i mora biti manji ili jednak njemu u oba stupca podataka",null,0,0,{"$f":"IF(PRRAS!D964>PRRAS!D616,1,0)","v":0},{"$f":"IF(PRRAS!E964>PRRAS!E616,1,0)","v":0},null,null,null,null,null,null,null,null,null,null,null,null,33048]
[141,"O.K.","AOP 951 je samo dio AOP-a 604 i mora biti manji ili jednak njemu u oba stupca podataka",null,0,0,{"$f":"IF(PRRAS!D965>PRRAS!D617,1,0)","v":0},{"$f":"IF(PRRAS!E965>PRRAS!E617,1,0)","v":0},null,null,null,null,null,null,null,null,null,null,null,null,33097]
[142,"O.K.","AOP 952 je samo dio AOP-a 605 i mora biti manji ili jednak njemu u oba stupca podataka",null,0,0,{"$f":"IF(PRRAS!D966>PRRAS!D618,1,0)","v":0},{"$f":"IF(PRRAS!E966>PRRAS!E618,1,0)","v":0},null,null,null,null,null,null,null,null,null,null,null,null,33101]
[143,"O.K.","AOP 608 mora biti jednak zbroju AOP-a: 953+954 u oba stupca podataka. Dopušteno je odstupanje od 1kn zbog zaokruživanja.",null,0,0,{"$f":"IF(ABS(PRRAS!D621-SUM(PRRAS!D967:D968))>1,1,0)","v":0},{"$f":"IF(ABS(PRRAS!E621-SUM(PRRAS!E967:E968))>1,1,0)","v":0},null,null,null,null,null,null,null,null,null,null,null,null,33169]
[{"$f":"1+A149","v":144},"O.K.","AOP 609 mora biti jednak zbroju AOP-a: 955+956 u oba stupca podataka. Dopušteno je odstupanje od 1kn zbog zaokruživanja.",null,0,0,{"$f":"IF(ABS(PRRAS!D622-SUM(PRRAS!D969:D970))>1,1,0)","v":0},{"$f":"IF(ABS(PRRAS!E622-SUM(PRRAS!E969:E970))>1,1,0)","v":0},null,null,null,null,null,null,null,null,null,null,null,null,33193]
[145,"O.K.","AOP 610 mora biti jednak zbroju AOP-a: 957+958 u oba stupca podataka. Dopušteno je odstupanje od 1kn zbog zaokruživanja.",null,0,0,{"$f":"IF(ABS(PRRAS!D623-SUM(PRRAS!D971:D972))>1,1,0)","v":0},{"$f":"IF(ABS(PRRAS!E623-SUM(PRRAS!E971:E972))>1,1,0)","v":0},null,null,null,null,null,null,null,null,null,null,null,null,33312]
[146,"O.K.","AOP 611 mora biti jednak zbroju AOP-a: 959+960 u oba stupca podataka. Dopušteno je odstupanje od 1kn zbog zaokruživanja.",null,0,0,{"$f":"IF(ABS(PRRAS!D624-SUM(PRRAS!D973:D974))>1,1,0)","v":0},{"$f":"IF(ABS(PRRAS!E624-SUM(PRRAS!E973:E974))>1,1,0)","v":0},null,null,null,null,null,null,null,null,null,null,null,null,33329]
[147,"O.K.","AOP 612 mora biti jednak zbroju AOP-a: 961+962 u oba stupca podataka. Dopušteno je odstupanje od 1kn zbog zaokruživanja.",null,0,0,{"$f":"IF(ABS(PRRAS!D625-SUM(PRRAS!D975:D976))>1,1,0)","v":0},{"$f":"IF(ABS(PRRAS!E625-SUM(PRRAS!E975:E976))>1,1,0)","v":0},null,null,null,null,null,null,null,null,null,null,null,null,33337]
[148,"O.K.","AOP 613 mora biti jednak zbroju AOP-a: 963+964 u oba stupca podataka. Dopušteno je odstupanje od 1kn zbog zaokruživanja.",null,0,0,{"$f":"IF(ABS(PRRAS!D626-SUM(PRRAS!D977:D978))>1,1,0)","v":0},{"$f":"IF(ABS(PRRAS!E626-SUM(PRRAS!E977:E978))>1,1,0)","v":0},null,null,null,null,null,null,null,null,null,null,null,null,33361]
[149,"O.K.","AOP 614 mora biti jednak zbroju AOP-a: 965+966 u oba stupca podataka. Dopušteno je odstupanje od 1kn zbog zaokruživanja.",null,0,0,{"$f":"IF(ABS(PRRAS!D627-SUM(PRRAS!D979:D980))>1,1,0)","v":0},{"$f":"IF(ABS(PRRAS!E627-SUM(PRRAS!E979:E980))>1,1,0)","v":0},null,null,null,null,null,null,null,null,null,null,null,null,33370]
[150,"O.K.","AOP 967 je samo dio AOP-a 623 i mora biti manji ili jednak njemu u oba stupca podataka",null,0,0,{"$f":"IF(PRRAS!D981>PRRAS!D636,1,0)","v":0},{"$f":"IF(PRRAS!E981>PRRAS!E636,1,0)","v":0},null,null,null,null,null,null,null,null,null,null,null,null,33407]
[{"$f":"1+A156","v":151},"O.K.","Samo na AOP oznakama 003 i 012 u iznimnim slučajevima iznosi mogu biti negativni, iznosi svih ostalih AOP-a moraju biti pozitivni. Ako je iznos ijednog drugog AOP-a negativan ova kontrola javlja pogrešku.",null,0,0,{"$f":"IF(MIN(Skriveni!C2:D3,Skriveni!C5:D12,Skriveni!C14:D976)<0,1,0)","v":0},null,null,null,null,null,null,null,null,null,null,null,null,null,33458]
[152,"O.K.","Vrijednosti svih AOP oznaka moraju biti zaokružene, cjelobrojne vrijednosti, ako je vrijednost neke AOP oznake upisana s decimalama kontrola javlja pogrešku i takav obrazac je neispravan.",null,0,0,{"$f":"IF(H158=0,0,1)","v":0},{"$f":"SUM(Skriveni!H2:H976)","v":0},null,null,null,null,null,null,null,null,null,null,null,{"$f":"IF(LOOKUP(O3,T159:T186,T159:T186)=O3,1,0)","v":0},33499]
[153,"O.K.","Obveznici razine 11 ne mogu imati popunjene AOP oznake: 003 do 010. Iznimka od tog pravila je obveznik s RKP-om 47123. Ako ova kontrola javlja pogrešku znači da je za obrazac razine 11 unesen iznos na neku od ovih pozicija.",null,0,0,{"$f":"IF(AND(I3=11,O3<>47123,OR(MAX(PRRAS!D14:E21)>0,MIN(PRRAS!D14:E21)<0)),1,0)","v":0},null,null,null,null,null,null,null,null,null,null,null,null,0,33520]
[154,"O.K.","Obveznici razine 11 ne mogu imati popunjene AOP oznake: 024 i 031. Iznimka od ovog pravila su neki obveznici koji iznimno mogu. Ako ova kontrola javlja pogrešku, znači da su ove pozicije popunjene ali se ne radi o obvezniku koji ih može imati popunjene.",null,{"$f":"MAX(G160:L160)","v":0},0,{"$f":"IF(AND(I3=11,MAX(PRRAS!D35:E35,PRRAS!D42:E42)>0,T158=0),1,0)","v":0},null,null,null,null,null,null,null,null,null,null,null,null,51,33538]
[155,"O.K.","Obveznici razine 11 ne mogu imati popunjene AOP oznake: 011 do 023, 025 do 030, 032 do 034, 040 do 044, 138, 200, 234 do 237 i 248. Ako je na bilo kojoj od ovih AOP oznaka upisan iznos, a obrazac je razine 11, kontrola javlja grešku i obrazac je neispravan. ",null,{"$f":"MAX(G161:L161)","v":0},0,{"$f":"IF(AND(I3=11,MAX(PRRAS!D22:E34,PRRAS!D36:E41,PRRAS!D43:E45,PRRAS!D51:E55,PRRAS!D149:E149,PRRAS!D211:E211,PRRAS!D245:E248,PRRAS!D259:E259)>0),1,0)","v":0},null,null,null,null,null,null,null,null,null,null,null,null,721,33579]
[156,"O.K.","Obveznici razine 11 ne mogu imati popunjenu AOP oznaku 249 osim obveznika s RKP-om: 47107. Ako ova kontrola javlja pogrešku znači da je za obrazac razine 11 unesen iznos na AOP poziciju 249.",null,{"$f":"MAX(G162:L162)","v":0},0,{"$f":"IF(AND(I3=11,O3<>47107,MAX(PRRAS!D260:E260)>0),1,0)","v":0},{"$f":"IF(AND(I5=11,O5<>47107,MIN(PRRAS!D260:E260)<0),1,0)","v":0},null,null,null,null,null,null,null,null,null,null,null,756,33600]
[157,"O.K.","Razina 11 ne smije imati popunjene AOP oznake: 414 do 416, 429 do 431, 435, 436, 451, 452, 455 do 458, 461, 470, 473, 475 do 479, 490 i 491. Ako je na bilo kojoj od ovih AOP oznaka upisan iznos, a obrazac je razine 11, kontrola javlja grešku i obrazac je neispravan.",null,0,0,{"$f":"IF(AND(I3=11,MAX(PRRAS!D427:E429,PRRAS!D442:E444,PRRAS!D448:E449,PRRAS!D464:E465,PRRAS!D468:E471,PRRAS!D474:E474,PRRAS!D483:E483,PRRAS!D486:E486,PRRAS!D488:E492,PRRAS!D503:E504)>0),1,0)","v":0},{"$f":"IF(AND(I5=11,MIN(PRRAS!D427:E429,PRRAS!D442:E444,PRRAS!D448:E449,PRRAS!D464:E465,PRRAS!D468:E471,PRRAS!D474:E474,PRRAS!D483:E483,PRRAS!D486:E486,PRRAS!D488:E492,PRRAS!D503:E504)<0),1,0)","v":0},null,null,null,null,null,null,null,null,null,null,null,1222,33618]
[158,"O.K.","Obveznici razine 11 ne mogu imati popunjenu AOP oznaku 495 i 605 osim obveznika s RKP-om  721. Ako je na bilo kojoj od ovih AOP oznaka upisan iznos, a obrazac je razine 11, kontrola javlja grešku i obrazac je neispravan. ",null,{"$f":"MAX(G164:L164)","v":0},0,{"$f":"IF(AND(I3=11,O3<>721,OR(MAX(PRRAS!D508:E508,PRRAS!D618:E618)>0,MIN(PRRAS!D508:E508,PRRAS!D618:E618)<0)),1,0)","v":0},null,null,null,null,null,null,null,null,null,null,null,null,3130,33860]
[159,"O.K.","Razina 11 ne smije imati popunjene AOP oznake: 496, 508, 511, 517, 520 do 524, 537 do 539, 543, 544, 560, 563, 568 I 569. Ako je na bilo kojoj od ovih AOP oznaka upisan iznos, a obrazac je razine 11, kontrola javlja grešku i obrazac je neispravan.",null,0,0,{"$f":"IF(AND(I3=11,O3<>721,MAX(PRRAS!D509:E509,PRRAS!D521:E521,PRRAS!D524:E524,PRRAS!D530:E530,PRRAS!D533:E537,PRRAS!D550:E552,PRRAS!D556:E557,PRRAS!D573:E573,PRRAS!D576:E576,PRRAS!D581:E582)>0),1,0)","v":0},null,null,null,null,null,null,null,null,null,null,null,null,3156,33878]
[160,"O.K.","Obveznici razine 11 ne mogu imati popunjenu AOP oznaku 579 osim obveznika s RKP-om: 46237. Ako ova kontrola javlja pogrešku znači da je za obrazac razine 11 unesen iznos na AOP poziciju 579.",null,0,0,{"$f":"IF(AND(I3=11,O3<>46237,OR(MAX(PRRAS!D592:E592)>0,MIN(PRRAS!D592:E592)<0)),1,0)","v":0},null,null,null,null,null,null,null,null,null,null,null,null,3164,33886]
[161,"O.K.","Obveznici razine 11 ne mogu imati popunjenu AOP oznaku 584 i 585 osim obveznika s RKP-om: 174. Ako ova kontrola javlja pogrešku znači da je za obrazac razine 11 unesen iznos na jednu od ovih AOP pozicija.",null,0,0,{"$f":"IF(AND(I3=11,O3<>174,OR(MAX(PRRAS!D597:E598)>0,MIN(PRRAS!D597:E598)<0)),1,0)","v":0},null,null,null,null,null,null,null,null,null,null,null,null,3197,33894]
[162,"O.K.","Razina 11 ne smije imati popunjene AOP oznake: 582, 586 do 588, 600, 601, 606, 616, 618, 621, 624, 685, 676, 699, 703, 705. Ako je na bilo kojoj od ovih AOP oznaka upisan iznos, a obrazac je razine 11, kontrola javlja grešku i obrazac je neispravan.",null,0,0,{"$f":"IF(AND(I3=11,MAX(PRRAS!D595:E595,PRRAS!D599:E601,PRRAS!D613:E614,PRRAS!D619:E619,PRRAS!D629:E631,PRRAS!D634:E634,PRRAS!D637:E637,PRRAS!D690:E690,PRRAS!D699:E699,PRRAS!D713:E713,PRRAS!D717:E717,PRRAS!D719:E719)>0),1,0)","v":0},null,null,null,null,null,null,null,null,null,null,null,null,3210,33925]
[163,"O.K.","Obveznici razine 12 ne mogu imati popunjene AOP oznake: 003 do 010. Iznimka od tog pravila je obveznik s RKP-om 47123. Ako ova kontrola javlja pogrešku znači da je za obrazac razine 11 unesen iznos na neku od ovih pozicija.",null,0,0,{"$f":"IF(AND(OR(I3=12,AND(I3=11,Q3=\"DA\")),O3<>47123,OR(MAX(PRRAS!D14:E21)>0,MIN(PRRAS!D14:E21)<0)),1,0)","v":0},null,null,null,null,null,null,null,null,null,null,null,null,3228,34282]
[{"$f":"1+A169","v":164},{"$f":"IF(E170=1,\"Pogreška\",IF(F170=1,\"Provjera\",\"O.K.\"))","v":"O.K."},"Obveznici razine 12 ne mogu imati popunjene AOP oznake: 024 i 031. Iznimka od ovog pravila su neki obveznici koji iznimno mogu. Ako ova kontrola javlja pogrešku, znači da su ove pozicije popunjene ali se ne radi o obvezniku koji ih može imati popunjene.",null,{"$f":"MAX(G170:L170)","v":0},0,{"$f":"IF(AND(OR(I3=12,AND(I3=11,Q3=\"DA\")),MAX(PRRAS!D35:E35,PRRAS!D42:E42)>0,T158=0),1,0)","v":0},null,null,null,null,null,null,null,null,null,null,null,null,3236,34387]
[{"$f":"1+A170","v":165},{"$f":"IF(E171=1,\"Pogreška\",IF(F171=1,\"Provjera\",\"O.K.\"))","v":"O.K."},"Razina 12 ne smije imati popunjene AOP oznake: 011 do 023, 025 do 030, 032 do 034, 138, 234 do 237. Ako je na bilo kojoj od ovih AOP oznaka upisan iznos, a obrazac je razine 12, kontrola javlja grešku i obrazac je neispravan. ",null,0,0,{"$f":"IF(AND(OR(I3=12,AND(I3=11,Q3=\"DA\")),MAX(PRRAS!D22:E34,PRRAS!D36:E41,PRRAS!D43:E45,PRRAS!D149:E149,PRRAS!D245:E248)>0),1,0)","v":0},null,null,null,null,null,null,null,null,null,null,null,null,3285,34418]
[166,"O.K.","Razina 12 ne smije imati popunjene AOP oznake: 414 do 416, 429 do 431, 435 do 436, 450 do 452, 455 do 458, 461, 477 do 479, 508, 511, 517, 520 do 524, 537 do 539, 543, 544. Ako je na bilo kojoj od ovih AOP oznaka upisan iznos za razinu 12 obrazac je neispravan. ",null,0,0,{"$f":"IF(AND(OR(I3=12,AND(I3=11,Q3=\"DA\")),MAX(PRRAS!D427:E429,PRRAS!D442:E444,PRRAS!D448:E449,PRRAS!D463:E465,PRRAS!D468:E471,PRRAS!D474:E474,PRRAS!D490:E492,PRRAS!D521:E521,PRRAS!D524:E524,PRRAS!D530:E530,PRRAS!D533:E537,PRRAS!D550:E552,PRRAS!D556:E557)>0),1,0)","v":0},null,null,null,null,null,null,null,null,null,null,null,null,3308,34426]
[167,"O.K.","Razina 12 ne smije imati popunjene AOP oznake: 560, 563, 567 do 569, 579, 582, 586 do 588, 616 do 618, 621, 624, 699, 701, 703, 705. Ako je na bilo kojoj od ovih AOP oznaka upisan iznos, a obrazac je razine 12 obrazac je neispravan.",null,0,0,{"$f":"IF(AND(OR(I3=12,AND(I3=11,Q3=\"DA\")),MAX(PRRAS!D573:E573,PRRAS!D576:E576,PRRAS!D580:E582,PRRAS!D592:E592,PRRAS!D595:E595,PRRAS!D599:E601,PRRAS!D629:E631,PRRAS!D634:E634,PRRAS!D637:E637,PRRAS!D713:E713,PRRAS!D715:E715,PRRAS!D717:E717,PRRAS!D719:E719)>0),1,0)","v":0},null,null,null,null,null,null,null,null,null,null,null,null,3316,34434]
[168,"O.K.","Razina 13 ne smije imati popunjene AOP oznake: 131 do 134. Ako je na bilo kojoj od ovih AOP oznaka upisan iznos, a obrazac je razine 13, kontrola javlja grešku i obrazac je neispravan.",null,0,0,{"$f":"IF(AND(I3=13,MAX(PRRAS!D142:E145)>0),1,0)","v":0},null,null,null,null,null,null,null,null,null,null,null,null,3349,34555]
[169,"O.K.","Razina 21 ne smije imati popunjene AOP oznake: 003 do 034, 040 do 044, 138, 172, 200, 222 do 227, 234 do 237 i 247 do 251, 340 i 368. Ako je na bilo kojoj od ovih AOP oznaka upisan iznos, a obrazac je razine 21 obrazac je neispravan.",null,0,0,{"$f":"IF(AND(I3=21,MAX(PRRAS!D14:E45,PRRAS!D51:E55,PRRAS!D149:E149,PRRAS!D183:E183,PRRAS!D211:E211,PRRAS!D233:E238,PRRAS!D245:E248,PRRAS!D258:E262,PRRAS!D352:E352,PRRAS!D380:E380)>0),1,0)","v":0},null,null,null,null,null,null,null,null,null,null,null,null,20727,34571]
[170,"O.K.","Razina 21 ne smije imati popunjene AOP oznake: 392, 412 do 416, 419, 429 do 431, 435, 436, 450 do 452, 455 do 458, 461, 470, 473, 475 do 479. Ako je na bilo kojoj od ovih AOP oznaka upisan iznos, a obrazac je razine 21 obrazac je neispravan.",null,0,0,{"$f":"IF(AND(I3=21,MAX(PRRAS!D404:E404,PRRAS!D425:E429,PRRAS!D432:E432,PRRAS!D442:E444,PRRAS!D448:E449,PRRAS!D463:E465,PRRAS!D468:E471,PRRAS!D474:E474,PRRAS!D483:E483,PRRAS!D486:E486,PRRAS!D488:E492)>0),1,0)","v":0},null,null,null,null,null,null,null,null,null,null,null,null,21668,34651]
[171,"O.K.","Razina 21 ne smije imati popunjene AOP oznake: 489 do 491, 495, 496, 508, 511 do 514, 517, 520 do 524, 527, 537 do 539, 543, 544, 560, 563, 564 do 569, 579 i 582. Ako je na bilo kojoj od ovih AOP oznaka upisan iznos za razinu 21 obrazac je neispravan.",null,0,0,{"$f":"IF(AND(I3=21,MAX(PRRAS!D502:E504,PRRAS!D508:E509,PRRAS!D521:E521,PRRAS!D524:E527,PRRAS!D530:E530,PRRAS!D533:E537,PRRAS!D540:E540,PRRAS!D550:E552,PRRAS!D556:E557,PRRAS!D573:E573,PRRAS!D576:E582,PRRAS!D592:E592,PRRAS!D595:E595)>0),1,0)","v":0},null,null,null,null,null,null,null,null,null,null,null,null,22275,34725]
[172,"O.K.","Razina 21 ne smije imati popunjene AOP oznake: 584 do 588, 599 do 601, 605, 606, 616 do 618, 621, 624, 685, 699, 701, 703, 705. Ako je na bilo kojoj od ovih AOP oznaka upisan iznos za razinu 21, obrazac je neispravan.",null,0,0,{"$f":"IF(AND(I3=21,MAX(PRRAS!D597:E601,PRRAS!D612:E614,PRRAS!D618:E619,PRRAS!D629:E631,PRRAS!D634:E634,PRRAS!D637:E637,PRRAS!D699:E699,PRRAS!D713:E713,PRRAS!D715:E715,PRRAS!D717:E717,PRRAS!D719:E719)>0),1,0)","v":0},null,null,null,null,null,null,null,null,null,null,null,null,26346,34872]
[{"$f":"1+A178","v":173},"O.K.","Razine 22 ne smiju imati popunjene AOP oznake: 012 do 017, 021, 025, 027, 032 do 034, 040 do 044, 131 do 135, 138, 172, 200, 247 do 252. Ako je na bilo kojoj od ovih AOP oznaka upisan iznos, a obrazac je razine 22 obrazac je neispravan.",null,0,0,{"$f":"IF(AND(I3=22,MAX(PRRAS!D23:E28,PRRAS!D32:E32,PRRAS!D36:E36,PRRAS!D38:E38,PRRAS!D43:E45,PRRAS!D51:E55,PRRAS!D142:E146,PRRAS!D149:E149,PRRAS!D183:E183,PRRAS!D211:E211,PRRAS!D258:E263)>0),1,0)","v":0},null,null,null,null,null,null,null,null,null,null,null,null,47037,34969]
[174,"O.K.","Razine 22 ne smiju imati popunjene AOP oznake: 340, 368, 392, 412 do 416, 419, 429 do 431, 435, 436, 450 do 452, 455 do 458, 461, 470, 473, 475 do 479. Ako je na bilo kojoj od ovih AOP oznaka upisan iznos, a obrazac je razine 22 obrazac je neispravan.",null,0,0,{"$f":"IF(AND(I3=22,MAX(PRRAS!D352:E352,PRRAS!D380:E380,PRRAS!D404:E404,PRRAS!D425:E429,PRRAS!D432:E432,PRRAS!D442:E444,PRRAS!D448:E449,PRRAS!D463:E465,PRRAS!D468:E471,PRRAS!D474:E474,PRRAS!D483:E483,PRRAS!D486:E486,PRRAS!D488:E492)>0),1,0)","v":0},null,null,null,null,null,null,null,null,null,null,null,null,47045,34993]
[175,"O.K.","Razine 22 ne smiju imati popunjene AOP oznake: 489 do 491, 495, 496, 508, 511 do 514, 517, 520 do 524, 527, 537 do 539, 543, 544, 560, 563 do 569, 579, 582. Ako je na bilo kojoj od ovih AOP oznaka upisan iznos, a obrazac je razine 22 obrazac je neispravan.",null,0,0,{"$f":"IF(AND(I3=22,MAX(PRRAS!D502:E504,PRRAS!D508:E509,PRRAS!D521:E521,PRRAS!D524:E527,PRRAS!D530:E530,PRRAS!D533:E537,PRRAS!D540:E540,PRRAS!D550:E552,PRRAS!D556:E557,PRRAS!D573:E573,PRRAS!D576:E582,PRRAS!D592:E592,PRRAS!D595:E595)>0),1,0)","v":0},null,null,null,null,null,null,null,null,null,null,null,null,47107,35062]
[176,"O.K.","Razine 22 ne smiju imati popunjene AOP oznake: 584 do 588, 599 do 601, 605, 606, 616 do 618, 621, 624, 685, 699, 701, 703, 705. Ako je na bilo kojoj od ovih AOP oznaka upisan iznos, a obrazac je razine 22 obrazac je neispravan.",null,0,0,{"$f":"IF(AND(I3=22,MAX(PRRAS!D597:E601,PRRAS!D612:E614,PRRAS!D618:E619,PRRAS!D629:E631,PRRAS!D634:E634,PRRAS!D637:E637,PRRAS!D699:E699,PRRAS!D713:E713,PRRAS!D715:E715,PRRAS!D717:E717,PRRAS!D719:E719)>0),1,0)","v":0},null,null,null,null,null,null,null,null,null,null,null,null,47115,35100]
[177,"O.K.","Razine 23 ne smiju imati popunjene AOP oznake: 012 do 017, 021, 025, 027, 032 do 034, 040 do 044, 069 do 073, 131 do 134, 138,172,200, 234 do 237, 241 do 245, 247 do 252, 340, 368 i 392. Ako je bilo koja od ovih AOP pozicija popunjena obrazac je neispravan.",null,0,0,{"$f":"IF(AND(I3=23,MAX(PRRAS!D23:E28,PRRAS!D32:E32,PRRAS!D36:E36,PRRAS!D38:E38,PRRAS!D43:E45,PRRAS!D51:E55,PRRAS!D80:D84,PRRAS!D142:E145,PRRAS!D183:E183,PRRAS!D211:E211,PRRAS!D245:E248,PRRAS!D252:E256,PRRAS!D258:E263,PRRAS!D352:E352,PRRAS!D380:E380,PRRAS!D404:E404)>0),1,0)","v":0},null,null,null,null,null,null,null,null,null,null,null,null,47439,35126]
[178,"O.K.","Razine 23 ne smiju imati popunjene AOP oznake: 412 do 416, 419, 429 do 431,435,436,450 do 452, 455 do 458, 461, 470, 473, 475 do 479, 489 do 491, 495 i 496. Ako je na bilo kojoj od ovih AOP oznaka upisan iznos za razinu 23 obrazac je neispravan.",null,0,0,{"$f":"IF(AND(I3=23,MAX(PRRAS!D425:E429,PRRAS!D432:E432,PRRAS!D442:E444,PRRAS!D448:E449,PRRAS!D463:E465,PRRAS!D468:E471,PRRAS!D474:E474,PRRAS!D483:E483,PRRAS!D486:E486,PRRAS!D488:E492,PRRAS!D502:E504,PRRAS!D508:E509)>0),1,0)","v":0},null,null,null,null,null,null,null,null,null,null,null,null,48808,35159]
[179,"O.K.","Razine 23 ne smiju imati popunjene AOP oznake: 508, 511 do 514, 517, 520 do 524, 527, 537 do 539, 543, 544, 560, 563 do 569, 579, 582, 584 do 588. Ako je na bilo kojoj od ovih AOP oznaka upisan iznos za razinu 23 obrazac je neispravan.",null,0,0,{"$f":"IF(AND(I3=23,MAX(PRRAS!D521:E521,PRRAS!D524:E527,PRRAS!D530:E530,PRRAS!D533:E537,PRRAS!D540:E540,PRRAS!D550:E552,PRRAS!D556:E557,PRRAS!D573:E573,PRRAS!D576:E582,PRRAS!D592:E592,PRRAS!D595:E595,PRRAS!D597:E601)>0),1,0)","v":0},null,null,null,null,null,null,null,null,null,null,null,null,49593,35191]
[180,"O.K.","Razine 23 ne smiju imati popunjene AOP oznake: 599 do 601, 605, 606, 616 do 618, 621, 624, 685, 699, 701, 703, 705. Ako je na bilo kojoj od ovih AOP oznaka upisan iznos za razinu 23 obrazac je neispravan.",null,0,0,{"$f":"IF(AND(I3=23,MAX(PRRAS!D612:E614,PRRAS!D618:E619,PRRAS!D629:E631,PRRAS!D634:E634,PRRAS!D637:E637,PRRAS!D699:E699,PRRAS!D713:E713,PRRAS!D715:E715,PRRAS!D717:E717,PRRAS!D719:E719)>0),1,0)","v":0},null,null,null,null,null,null,null,null,null,null,null,null,99999,35206]
[181,"O.K.","Razina 31 ne smije imati popunjene AOP oznake: 003 do 034, 040 do 044, 138, 172, 200, 222 do 227, 234 do 237, 247 do 252, 340, 368, 392. Ako je na bilo kojoj od ovih AOP oznaka upisan iznos za razinu 31 obrazac je neispravan.",null,0,0,{"$f":"IF(AND(I3=31,MAX(PRRAS!D14:E45,PRRAS!D51:E55,PRRAS!D149:E149,PRRAS!D183:E183,PRRAS!D211:E211,PRRAS!D233:E238,PRRAS!D245:E248,PRRAS!D258:E263,PRRAS!D352:E352,PRRAS!D380:E380,PRRAS!D404:E404)>0),1,0)","v":0},null,null,null,null,null,null,null,null,null,null,null,null,null,35214]
[{"$f":"1+A187","v":182},"O.K.","Razina 31 ne smije imati popunjene AOP oznake: 412 do 416, 419, 429 do 431, 435, 436, 450 do 452, 455 do 458, 461, 473, 475 do 479, 489 do 491, 495, 496. Ako je na bilo kojoj od ovih AOP oznaka upisan iznos za razinu 31 obrazac je neispravan.",null,{"$f":"MAX(G188:L188)","v":0},0,{"$f":"IF(AND(I3=31,MAX(PRRAS!D425:E429,PRRAS!D432:E432,PRRAS!D442:E444,PRRAS!D448:E449,PRRAS!D463:E465,PRRAS!D468:E471,PRRAS!D474:E474,PRRAS!D486:E486,PRRAS!D488:E492,PRRAS!D502:E504,PRRAS!D508:E509)>0),1,0)","v":0},null,null,null,null,null,null,null,null,null,null,null,null,null,35271]
[{"$f":"1+A188","v":183},"O.K.","Razina 31 ne smije imati popunjene AOP oznake: 508, 511 do 514, 517, 520 do 524, 527, 537 do 539, 543, 544, 560, 563 do 569, 579, 582, 584 do 588. Ako je na bilo kojoj od ovih AOP oznaka upisan iznos za razinu 31 obrazac je neispravan.",null,0,0,{"$f":"IF(AND(I3=31,MAX(PRRAS!D521:E521,PRRAS!D524:E527,PRRAS!D530:E530,PRRAS!D533:E537,PRRAS!D540:E540,PRRAS!D550:E552,PRRAS!D556:E557,PRRAS!D573:E573,PRRAS!D576:E582,PRRAS!D592:E592,PRRAS!D595:E595,PRRAS!D597:E601)>0),1,0)","v":0},null,null,null,null,null,null,null,null,null,null,null,null,null,35319]
[184,"O.K.","Razina 31 ne smije imati popunjene AOP oznake: 605, 606, 616 do 618, 621, 624, 642, 644, 685, 699, 701, 703, 705. Ako je na bilo kojoj od ovih AOP oznaka upisan iznos za razinu 31 obrazac je neispravan.",null,0,0,{"$f":"IF(AND(I3=31,MAX(PRRAS!D618:E619,PRRAS!D629:E631,PRRAS!D634:E634,PRRAS!D637:E637,PRRAS!D656:E656,PRRAS!D658:E658,PRRAS!D699:E699,PRRAS!D713:E713,PRRAS!D715:E715,PRRAS!D717:E717,PRRAS!D719:E719)>0),1,0)","v":0},null,null,null,null,null,null,null,null,null,null,null,null,null,35409]
[185,"O.K.","Obveznici razine 41 ne smiju imati popunjene AOP oznake: 131 do 134. Iznimka od tog pravila su obveznici s RKP-om 23911 i 25843. Ako ova kontrola javlja pogrešku znači da je za obrazac razine 11 unesen iznos na neku od ovih pozicija.",null,0,0,{"$f":"IF(AND(I3=41,O3<>23911,O3<>25843,MAX(PRRAS!D142:E145)>0),1,0)","v":0},null,null,null,null,null,null,null,null,null,null,null,null,null,35433]
[186,"O.K.","Razina 41 ne smije imati popunjene AOP oznake: 003 do 034, 135, 138, 172, 340, 392, 412 do 416, 419, 429 do 431, 435, 436, 450 do 452, 455 do 458, 477 do 479. Ako je na bilo kojoj od ovih AOP oznaka upisan iznos za razinu 41obrazac je neispravan.",null,0,0,{"$f":"IF(AND(I3=41,MAX(PRRAS!D14:E45,PRRAS!D146:E146,PRRAS!D149:E149,PRRAS!D183:E183,PRRAS!D352:E352,PRRAS!D404:E404,PRRAS!D425:E429,PRRAS!D432:E432,PRRAS!D442:E444,PRRAS!D448:E449,PRRAS!D463:E465,PRRAS!D468:E471,PRRAS!D490:E492)>0),1,0)","v":0},null,null,null,null,null,null,null,null,null,null,null,null,null,35484]
[187,"O.K.","Razina 41 ne smije imati popunjene AOP oznake: 508, 511 do 514, 517, 520 do 524, 527, 537 do 539, 543, 544, 560, 563 do 569, 579, 582, 586 do 588. Ako je na bilo kojoj od ovih AOP oznaka upisan iznos za razinu 41 obrazac je neispravan",null,0,0,{"$f":"IF(AND(I3=41,MAX(PRRAS!D521:E521,PRRAS!D524:E527,PRRAS!D530:E530,PRRAS!D533:E537,PRRAS!D540:E540,PRRAS!D550:E552,PRRAS!D556:E557,PRRAS!D573:E573,PRRAS!D576:E582,PRRAS!D592:E592,PRRAS!D595:E595,PRRAS!D599:E601)>0),1,0)","v":0},null,null,null,null,null,null,null,null,null,null,null,null,null,35548]
[188,"O.K.","Razina 41 ne smije imati popunjene AOP oznake: 616 do 618, 621, 624, 642, 644, 699, 701, 703, 705. Ako je na bilo kojoj od ovih AOP oznaka upisan iznos za razinu 41 obrazac je neispravan.",null,0,0,{"$f":"IF(AND(I3=41,MAX(PRRAS!D629:E631,PRRAS!D634:E634,PRRAS!D637:E637,PRRAS!D656:E656,PRRAS!D658:E658,PRRAS!D713:E713,PRRAS!D715:E715,PRRAS!D717:E717,PRRAS!D719:E719)>0),1,0)","v":0},null,null,null,null,null,null,null,null,null,null,null,null,null,35669]
[{"$f":"1+A194","v":189},"O.K.","Razina 42 ne smije imati popunjene AOP oznake: 003 do 034, 040 do 044,131 do 135, 138, 172, 222 do 227, 247 do 252, 340 i 392. Ako je na bilo kojoj od ovih AOP oznaka upisan iznos za razinu 42 obrazac je neispravan.",null,{"$f":"MAX(G195:L195)","v":0},0,{"$f":"IF(AND(I3=42,MAX(PRRAS!D14:E45,PRRAS!D51:E55,PRRAS!D142:E146,PRRAS!D149:E149,PRRAS!D183:E183,PRRAS!D233:E238,PRRAS!D258:E263,PRRAS!D352:E352,PRRAS!D404:E404)>0),1,0)","v":0},null,null,null,null,null,null,null,null,null,null,null,null,null,35708]
[{"$f":"1+A195","v":190},"O.K.","Razina 42 ne smije imati popunjene AOP oznake: 412 do 416, 419, 429 do 431, 435, 436, 450 do 452, 455 do 458, 461, 470, 473, 475 do 479, 508, 511 do 514. Ako je na bilo kojoj od ovih AOP oznaka upisan iznos za razinu 42 obrazac je neispravan.",null,{"$f":"MAX(G196:L196)","v":0},0,{"$f":"IF(AND(I3=42,MAX(PRRAS!D425:E429,PRRAS!D432:E432,PRRAS!D442:E444,PRRAS!D448:E449,PRRAS!D463:E465,PRRAS!D468:E471,PRRAS!D474:E474,PRRAS!D483:E483,PRRAS!D486:E486,PRRAS!D488:E492,PRRAS!D521:E521,PRRAS!D524:E527)>0),1,0)","v":0},null,null,null,null,null,null,null,null,null,null,null,null,null,35716]
[{"$f":"1+A196","v":191},"O.K.","Razina 42 ne smije imati popunjene AOP oznake: 517, 520 do 524, 527, 537 do 539, 543, 544, 560, 563 do 569, 579, 582, 586 do 588. Ako je na bilo kojoj od ovih AOP oznaka upisan iznos za razinu 42 obrazac je neispravan.",null,{"$f":"MAX(G197:L197)","v":0},0,{"$f":"IF(AND(I3=42,MAX(PRRAS!D530:E530,PRRAS!D533:E537,PRRAS!D540:E540,PRRAS!D550:E552,PRRAS!D556:E557,PRRAS!D573:E573,PRRAS!D576:E582,PRRAS!D592:E592,PRRAS!D595:E595,PRRAS!D599:E601)>0),1,0)","v":0},null,null,null,null,null,null,null,null,null,null,null,null,null,35757]
[{"$f":"1+A197","v":192},"O.K.","Razina 42 ne smije imati popunjene AOP oznake: 616 do 618, 621, 624, 642, 644, 685, 699, 701, 703, 705. Ako je na bilo kojoj od ovih AOP oznaka upisan iznos za razinu 42 obrazac je neispravan.",null,{"$f":"MAX(G198:L198)","v":0},0,{"$f":"IF(AND(I3=42,MAX(PRRAS!D629:E631,PRRAS!D634:E634,PRRAS!D637:E637,PRRAS!D656:E656,PRRAS!D658:E658,PRRAS!D699:E699,PRRAS!D713:E713,PRRAS!D715:E715,PRRAS!D717:E717,PRRAS!D719:E719)>0),1,0)","v":0},null,null,null,null,null,null,null,null,null,null,null,null,null,35790]
[{"$f":"1+A198","v":193},"O.K.","Kod razine 11 korisnici mogu imati popunjen samo broj zaposlenih kod korisnika (AOP 643 i 645), a glave unutar nadležnog ministarstva mogu imati popunjene samo zaposlene u tijelima (AOP 642 i 644). Ova kontrola upozorava kada su istovremeno popunjene AOP oznake 642 i 643 ili 644 i 645 (broj zaposleni u tijelima i kod korisnika), što mogu imati popunjene samo glave unutar nadležnog ministarstva / razdjela koja imaju iskazane i rashode proračunskih korisnika iz svoje nadležnosti.",null,0,{"$f":"MAX(L199:O199)","v":0},null,null,null,null,null,{"$f":"IF(AND($I$3=11,OR(PRRAS!D656>0,PRRAS!D658>0),OR(PRRAS!D657>0,PRRAS!D659>0)),1,0)","v":0},{"$f":"IF(AND($I$3=11,OR(PRRAS!E656>0,PRRAS!E658>0),OR(PRRAS!E657>0,PRRAS!E659>0)),1,0)","v":0},null,null,null,null,null,null,null,35888]
[194,"O.K.","Ako je iznos na AOP-u 019 veći od nule, a iznos na AOP-u 647 (porez na korištenje javnih površina) je jednak nuli, provjerite AOP 647. Ako je njegov iznos stvarno toliki, zanemarite ovu kontrolu.",null,0,0,null,null,null,null,null,{"$f":"IF(AND(PRRAS!D30>0,PRRAS!D661=0),1,0)","v":0},{"$f":"IF(AND(PRRAS!E30>0,PRRAS!E661=0),1,0)","v":0},null,null,null,null,null,null,null,35896]
[195,"O.K.","Ako je iznos na AOP-u 028 veći od nule, a iznosi na AOP-u 648 (porez na cestovna motorna vozila) i na AOP-u 649 (porez na tvrtku odnosno naziv tvrtke) su jednaki nuli, provjerite AOP-e 648 i 649 . Ako su njihovi iznosi stvarno toliki, zanemarite ovu kontrolu.",null,0,0,null,null,null,null,null,{"$f":"IF(AND(PRRAS!D39>0,SUM(PRRAS!D662:'PRRAS'!D663)=0),1,0)","v":0},{"$f":"IF(AND(PRRAS!E39>0,SUM(PRRAS!E662:'PRRAS'!E663)=0),1,0)","v":0},null,null,null,null,null,null,null,35907]
[196,"O.K.","Ako je iznos na AOP-u 082 veći od nule, a iznos na AOP-u 676 (premije na izdane vrijednosne papire) je jednak nuli, provjerite AOP 676. Ako je njegov iznos stvarno toliki, zanemarite ovu kontrolu.",null,0,0,null,null,null,null,null,{"$f":"IF(AND(PRRAS!D93>0,PRRAS!D690=0),1,0)","v":0},{"$f":"IF(AND(PRRAS!E93>0,PRRAS!E690=0),1,0)","v":0},null,null,null,null,null,null,null,35923]
[197,{"$f":"IF(E203=1,\"Pogreška\",IF(F203=1,\"Provjera\",\"O.K.\"))","v":"O.K."},"Ako je iznos na AOP-u 116 veći od nule, a iznosi na AOP-u 684 (sufinanciranje cijene usluge, participacije i slično), na AOP-u 685 (dopunsko zdravstveno osiguranje) i na AOP-u 686(prihodi s naslova osiguranja, refundacije štete i totalne štete) su jednaki nuli, provjerite AOP-e 684, 685 i 686. Ako su njihovi iznosi stvarno toliki, zanemarite ovu kontrolu.",null,0,0,null,null,null,null,null,{"$f":"IF(AND(PRRAS!D127>0,SUM(PRRAS!D698:'PRRAS'!D700)=0),1,0)","v":0},{"$f":"IF(AND(PRRAS!E127>0,SUM(PRRAS!E698:'PRRAS'!E700)=0),1,0)","v":0},null,null,null,null,null,null,null,35931]
[198,"O.K.","Ako je iznos na AOP-u 155 veći od nule, a iznosi na AOP-u 687 (otpremnine) i na AOP-u 688 (naknade za bolest, invalidnost i smrtni slučaj) su jednaki nuli, provjerite AOP-e 687 i 688. Ako su njihovi iznosi stvarno toliki, zanemarite ovu kontrolu.",null,0,0,null,null,null,null,null,{"$f":"IF(AND(PRRAS!D166>0,SUM(PRRAS!D701:D702)=0),1,0)","v":0},{"$f":"IF(AND(PRRAS!E166>0,SUM(PRRAS!E701:E702)=0),1,0)","v":0},null,null,null,null,null,null,null,35940]
[199,"O.K.","Ako je iznos na AOP-u 180 veći od nule, a iznos na AOP-u 691 (obvezni i preventivni zdravstveni pregledi zaposlenika) je jednak nuli, provjerite AOP 691. Ako je njegov iznos stvarno toliki, zanemarite ovu kontrolu.",null,0,0,null,null,null,null,null,{"$f":"IF(AND(PRRAS!D191>0,PRRAS!D705=0),1,0)","v":0},{"$f":"IF(AND(PRRAS!E191>0,PRRAS!E705=0),1,0)","v":0},null,null,null,null,null,null,null,35958]
[200,"O.K.","Ako je iznos na AOP-u 181 veći od nule, a iznosi na AOP-u 692 (autorski honorari), AOP-u 693 (ugovori o djelu) i na AOP-u 694 (usluge agencija, studentskog servisa (prijepisi, prijevodi i drugo)) su jednaki nuli, provjerite AOP-e 692,693 i 694. Ako su njihovi iznosi stvarno toliki, zanemarite ovu kontrolu.",null,0,0,null,null,null,null,null,{"$f":"IF(AND(PRRAS!D192>0,SUM(PRRAS!D706:D708)=0),1,0)","v":0},{"$f":"IF(AND(PRRAS!E192>0,SUM(PRRAS!E706:E708)=0),1,0)","v":0},null,null,null,null,null,null,null,35974]
[201,"O.K.","Ako je iznos na AOP-u 183 veći od nule, a iznos na AOP-u 695 (naknada za energetsku uslugu) je jednak nuli, provjerite AOP 695. Ako je njegov iznos stvarno toliki, zanemarite ovu kontrolu.",null,0,0,null,null,null,null,null,{"$f":"IF(AND(PRRAS!D194>0,PRRAS!D709=0),1,0)","v":0},{"$f":"IF(AND(PRRAS!E194>0,PRRAS!E709=0),1,0)","v":0},null,null,null,null,null,null,null,36047]
[202,"O.K.","Ako je iznos na AOP-u 186 veći od nule, a iznos na AOP-u 696 (naknade članovima predstavničkih i izvršnih tijela i upravnih vijeća) je jednak nuli, provjerite AOP 696. Ako je njegov iznos stvarno toliki, zanemarite ovu kontrolu.",null,0,0,null,null,null,null,null,{"$f":"IF(AND(PRRAS!D197>0,PRRAS!D710=0),1,0)","v":0},{"$f":"IF(AND(PRRAS!E197>0,PRRAS!E710=0),1,0)","v":0},null,null,null,null,null,null,null,36080]
[203,"O.K.","Ako je iznos na AOP-u 187 veći od nule, a iznos na AOP-u 697 (premije osiguranja zaposlenih) je jednak nuli, provjerite AOP 697. Ako je njegov iznos stvarno toliki, zanemarite ovu kontrolu.",null,0,0,null,null,null,null,null,{"$f":"IF(AND(PRRAS!D198>0,PRRAS!D711=0),1,0)","v":0},{"$f":"IF(AND(PRRAS!E198>0,PRRAS!E711=0),1,0)","v":0},null,null,null,null,null,null,null,36098]
[{"$f":"1+A209","v":204},"O.K.","Ako je iznos na AOP-u 205 veći od nule, a iznosi na AOP-u 719 (kamate za primljene zajmove od tuzemnih trgovačkih društava izvan javnog sektora), AOP-u 720 (kamate za primljene zajmove od tuzemnih obrtnika) i na AOP-u 721 (kamate za primljene zajmove od inozemnih trgovačkih društava) su jednaki nuli, provjerite AOP-e 719 do 721 Ako su njihovi iznosi stvarno toliki, zanemarite kontrolu.",null,0,0,null,null,null,null,null,{"$f":"IF(AND(PRRAS!D216>0,SUM(PRRAS!D733:D735)=0),1,0)","v":0},{"$f":"IF(AND(PRRAS!E216>0,SUM(PRRAS!E733:E735)=0),1,0)","v":0},null,null,null,null,null,null,null,36119]
[205,"O.K.","Ako je iznos na AOP-u 211 veći od nule, a iznos na AOP-u 729 (diskont na izdane vrijednosne papire) je jednak nuli, provjerite AOP 729. Ako je njegov iznos stvarno toliki, zanemarite ovu kontrolu.",null,0,0,null,null,null,null,null,{"$f":"IF(AND(PRRAS!D222>0,PRRAS!D743=0),1,0)","v":0},{"$f":"IF(AND(PRRAS!E222>0,PRRAS!E743=0),1,0)","v":0},null,null,null,null,null,null,null,36127]
[206,"O.K.","AOP 254 mora biti jednak zbroju AOP oznaka 771 do 779 uz dopušteno odstupanje od 1.",null,{"$f":"MAX(G212:K212)","v":0},0,{"$f":"IF(ABS(PRRAS!D265-SUM(PRRAS!D785:D793)>1),1,0)","v":0},{"$f":"IF(ABS(PRRAS!E265-SUM(PRRAS!E785:E793)>1),1,0)","v":0},null,null,null,null,null,null,null,null,null,null,null,null,36225]
[207,"O.K.","Ako je iznos na AOP-u 259 veći od nule, a iznos na AOP-u 785 (tekuće donacije građanima i kućanstvima) je jednak nuli, provjerite AOP 785. Ako je njegov iznos stvarno toliki, zanemarite ovu kontrolu.",null,0,0,null,null,null,null,null,{"$f":"IF(AND(PRRAS!D270>0,PRRAS!D799=0),1,0)","v":0},{"$f":"IF(AND(PRRAS!E270>0,PRRAS!E799=0),1,0)","v":0},null,null,null,null,null,null,null,36233]
[208,"O.K.","Ako je iznos na AOP-u 418 veći od nule, a iznos na AOP-ima 799 i 800 jednak nuli, provjerite AOP-e 799 i 800. Ako je njihov iznos stvarno toliki, zanemarite ovu kontrolu.",null,0,0,null,null,null,null,null,{"$f":"IF(AND(PRRAS!D431>0,SUM(PRRAS!D813:D814)=0),1,0)","v":0},{"$f":"IF(AND(PRRAS!E431>0,SUM(PRRAS!E813:E814)=0),1,0)","v":0},null,null,null,null,null,null,null,36276]
[209,"O.K.","Ako je iznos na AOP-u 421 veći od nule, a iznos na AOP-ima 801 i 802 jednak nuli, provjerite AOP-e 801 i 802. Ako je njihov iznos stvarno toliki, zanemarite ovu kontrolu.",null,0,0,null,null,null,null,null,{"$f":"IF(AND(PRRAS!D434>0,SUM(PRRAS!D815:D816)=0),1,0)","v":0},{"$f":"IF(AND(PRRAS!E434>0,SUM(PRRAS!E815:E816)=0),1,0)","v":0},null,null,null,null,null,null,null,36372]
[210,"O.K.","Ako je iznos na AOP-u 422 veći od nule, a iznos na AOP-ima 803 i 804 jednak nuli, provjerite AOP-e 803 i 804. Ako je njihov iznos stvarno toliki, zanemarite ovu kontrolu.",null,0,0,null,null,null,null,null,{"$f":"IF(AND(PRRAS!D435>0,SUM(PRRAS!D817:D818)=0),1,0)","v":0},{"$f":"IF(AND(PRRAS!E435>0,SUM(PRRAS!E817:E818)=0),1,0)","v":0},null,null,null,null,null,null,null,36428]
[211,"O.K.","Ako je iznos na AOP-u 423 veći od nule, a iznos na AOP-ima 805 i 806 jednak nuli, provjerite AOP-e 805 i 806. Ako je njihov iznos stvarno toliki, zanemarite ovu kontrolu.",null,0,0,null,null,null,null,null,{"$f":"IF(AND(PRRAS!D436>0,SUM(PRRAS!D819:D820)=0),1,0)","v":0},{"$f":"IF(AND(PRRAS!E436>0,SUM(PRRAS!E819:E820)=0),1,0)","v":0},null,null,null,null,null,null,null,36524]
[212,"O.K.","Ako je iznos na AOP-u 426 veći od nule, a iznos na AOP-ima 810 i 811 jednak nuli, provjerite AOP-e 810 i 811. Ako je njihov iznos stvarno toliki, zanemarite ovu kontrolu.",null,0,0,null,null,null,null,null,{"$f":"IF(AND(PRRAS!D439>0,SUM(PRRAS!D824:D825)=0),1,0)","v":0},{"$f":"IF(AND(PRRAS!E439>0,SUM(PRRAS!E824:E825)=0),1,0)","v":0},null,null,null,null,null,null,null,36532]
[213,"O.K.","Ako je iznos na AOP-u 427 veći od nule, a iznos na AOP-ima 812 i 813 jednak nuli, provjerite AOP-e 812 i 813. Ako je njihov iznos stvarno toliki, zanemarite ovu kontrolu.",null,0,0,null,null,null,null,null,{"$f":"IF(AND(PRRAS!D440>0,SUM(PRRAS!D826:D827)=0),1,0)","v":0},{"$f":"IF(AND(PRRAS!E440>0,SUM(PRRAS!E826:E827)=0),1,0)","v":0},null,null,null,null,null,null,null,36549]
[214,"O.K.","Ako je iznos na AOP-u 428 veći od nule, a iznos na AOP-ima 814 i 815 jednak nuli, provjerite AOP-e 814 i 815. Ako je njihov iznos stvarno toliki, zanemarite ovu kontrolu.",null,0,0,null,null,null,null,null,{"$f":"IF(AND(PRRAS!D441>0,SUM(PRRAS!D828:D829)=0),1,0)","v":0},{"$f":"IF(AND(PRRAS!E441>0,SUM(PRRAS!E828:E829)=0),1,0)","v":0},null,null,null,null,null,null,null,36604]
[215,"O.K.","Ako je iznos na AOP-u 460 veći od nule, a iznos na AOP-u 842 (ostali vrijednosni papiri - dugoročni) je jednak nuli, provjerite AOP 842. Ako je njegov iznos stvarno toliki, zanemarite ovu kontrolu.",null,0,0,null,null,null,null,null,{"$f":"IF(AND(PRRAS!D473>0,PRRAS!D856=0),1,0)","v":0},{"$f":"IF(AND(PRRAS!E473>0,PRRAS!E856=0),1,0)","v":0},null,null,null,null,null,null,null,36612]
[216,"O.K.","Ako je iznos na AOP-u 476 veći od nule, a iznos na AOP-u 843 (primljeni zajmovi od međunarodnih organizacija - dugoročni) je jednak nuli, provjerite AOP 843. Ako je njegov iznos stvarno toliki, zanemarite ovu kontrolu.",null,0,0,null,null,null,null,null,{"$f":"IF(AND(PRRAS!D489>0,PRRAS!D857=0),1,0)","v":0},{"$f":"IF(AND(PRRAS!E489>0,PRRAS!E857=0),1,0)","v":0},null,null,null,null,null,null,null,36645]
[217,"O.K.","Ako je iznos na AOP-u 477 veći od nule, a iznos na AOP-u 844 (primljeni krediti i zajmovi od institucija i tijela EU - dugoročni) je jednak nuli, provjerite AOP 844 Ako je njegov iznos stvarno toliki, zanemarite ovu kontrolu.",null,0,0,null,null,null,null,null,{"$f":"IF(AND(PRRAS!D490>0,PRRAS!D858=0),1,0)","v":0},{"$f":"IF(AND(PRRAS!E490>0,PRRAS!E858=0),1,0)","v":0},null,null,null,null,null,null,null,36653]
[218,"O.K.","Ako je iznos na AOP-u 478 veći od nule, a iznos na AOP-u 845 (primljeni zajmovi od inozemnih vlada u EU - dugoročni) je jednak nuli, provjerite AOP 845. Ako je njegov iznos stvarno toliki, zanemarite ovu kontrolu.",null,0,0,null,null,null,null,null,{"$f":"IF(AND(PRRAS!D491>0,PRRAS!D859=0),1,0)","v":0},{"$f":"IF(AND(PRRAS!E491>0,PRRAS!E859=0),1,0)","v":0},null,null,null,null,null,null,null,36688]
[219,"O.K.","Ako je iznos na AOP-u 479 veći od nule, a iznos na AOP-u 846 (primljeni zajmovi od inozemnih vlada izvan EU - dugoročni) je jednak nuli, provjerite AOP 846. Ako je njegov iznos stvarno toliki, zanemarite ovu kontrolu.",null,0,0,null,null,null,null,null,{"$f":"IF(AND(PRRAS!D492>0,PRRAS!D860=0),1,0)","v":0},{"$f":"IF(AND(PRRAS!E492>0,PRRAS!E860=0),1,0)","v":0},null,null,null,null,null,null,null,36696]
[220,"O.K.","Ako je iznos na AOP-u 482 veći od nule, a iznos na AOP-u 850 (primljeni zajmovi od osiguravajućih društava u javnom sektoru - dugoročni) je jednak nuli, provjerite AOP 850. Ako je njegov iznos stvarno toliki, zanemarite ovu kontrolu.",null,0,0,null,null,null,null,null,{"$f":"IF(AND(PRRAS!D495>0,PRRAS!D864=0),1,0)","v":0},{"$f":"IF(AND(PRRAS!E495>0,PRRAS!E864=0),1,0)","v":0},null,null,null,null,null,null,null,36707]
[221,"O.K.","Ako je iznos na AOP-u 483 veći od nule, a iznos na AOP-ima 851 i 852 jednaki nuli, provjerite AOP-e 851 i 852. Ako je njihov iznos stvarno toliki, zanemarite ovu kontrolu.",null,0,0,null,null,null,null,null,{"$f":"IF(AND(PRRAS!D496>0,SUM(PRRAS!D865:D866)=0),1,0)","v":0},{"$f":"IF(AND(PRRAS!E496>0,SUM(PRRAS!E865:E866)=0),1,0)","v":0},null,null,null,null,null,null,null,36715]
[222,"O.K.","Ako je iznos na AOP-u 484 veći od nule, a iznos na AOP-u 853 (primljeni zajmovi od trgovačkih društava u javnom sektoru - dugoročni) je jednak nuli, provjerite AOP 853. Ako je njegov iznos stvarno toliki, zanemarite ovu kontrolu.",null,0,0,null,null,null,null,null,{"$f":"IF(AND(PRRAS!D497>0,PRRAS!D867=0),1,0)","v":0},{"$f":"IF(AND(PRRAS!E497>0,PRRAS!E867=0),1,0)","v":0},null,null,null,null,null,null,null,36723]
[223,"O.K.","Ako je iznos na AOP-u 487 veći od nule, a iznos na AOP-u 857 (primljeni zajmovi od tuzemnih osiguravajućih društava izvan javnog sektora - dugoročni) je jednak nuli, provjerite AOP 857. Ako je njegov iznos stvarno toliki, zanemarite ovu kontrolu.",null,0,0,null,null,null,null,null,{"$f":"IF(AND(PRRAS!D500>0,PRRAS!D871=0),1,0)","v":0},{"$f":"IF(AND(PRRAS!E500>0,PRRAS!E871=0),1,0)","v":0},null,null,null,null,null,null,null,36731]
[224,"O.K.","Ako je iznos na AOP-u 488 veći od nule, a iznos na AOP-ima 858 i 859 jednaki nuli, provjerite AOP-e 858 i 859. Ako je njihov iznos stvarno toliki, zanemarite ovu kontrolu.",null,0,0,null,null,null,null,null,{"$f":"IF(AND(PRRAS!D501>0,SUM(PRRAS!D872:D873)=0),1,0)","v":0},{"$f":"IF(AND(PRRAS!E501>0,SUM(PRRAS!E872:E873)=0),1,0)","v":0},null,null,null,null,null,null,null,36758]
[225,"O.K.","Ako je iznos na AOP-u 490 veći od nule, a iznos na AOP-u 863 (primljeni zajmovi od inozemnih osiguravajućih društava - dugoročni) je jednak nuli, provjerite AOP 863. Ako je njegov iznos stvarno toliki, zanemarite ovu kontrolu.",null,0,{"$f":"MAX(L231:O231)","v":0},null,null,null,null,null,{"$f":"IF(AND(PRRAS!D503>0,PRRAS!D877=0),1,0)","v":0},{"$f":"IF(AND(PRRAS!E503>0,PRRAS!E877=0),1,0)","v":0},null,null,null,null,null,null,null,36766]
[226,"O.K.","Ako je iznos na AOP-u 491 veći od nule, a iznos na AOP-ima 864 i 865 jednaki nuli, provjerite AOP-e 864 i 865. Ako je njihov iznos stvarno toliki, zanemarite ovu kontrolu.",null,0,0,null,null,null,null,null,{"$f":"IF(AND(PRRAS!D504>0,SUM(PRRAS!D878:D879)=0),1,0)","v":0},{"$f":"IF(AND(PRRAS!E504>0,SUM(PRRAS!E878:E879)=0),1,0)","v":0},null,null,null,null,null,null,null,36774]
[227,"O.K.","Ako je iznos na AOP-u 493 veći od nule, a iznos na AOP-u 866 (primljeni zajmovi od tuzemnih trgovačkih društava izvan javnog sektora - dugoročni) je jednak nuli, provjerite AOP 866. Ako je njegov iznos stvarno toliki, zanemarite ovu kontrolu.",null,0,0,null,null,null,null,null,{"$f":"IF(AND(PRRAS!D506>0,PRRAS!D880=0),1,0)","v":0},{"$f":"IF(AND(PRRAS!E506>0,PRRAS!E880=0),1,0)","v":0},null,null,null,null,null,null,null,36782]
[228,"O.K.","Ako je iznos na AOP-u 494 veći od nule, a iznos na AOP-u 867 (primljeni zajmovi od tuzemnih obrtnika - dugoročni) je jednak nuli, provjerite AOP 867. Ako je njegov iznos stvarno toliki, zanemarite ovu kontrolu.",null,0,0,null,null,null,null,null,{"$f":"IF(AND(PRRAS!D507>0,PRRAS!D881=0),1,0)","v":0},{"$f":"IF(AND(PRRAS!E507>0,PRRAS!E881=0),1,0)","v":0},null,null,null,null,null,null,null,36799]
[229,"O.K.","Ako je iznos na AOP-u 495 veći od nule, a iznos na AOP-u 868 (primljeni zajmovi od inozemnih trgovačkih društava - dugoročni) je jednak nuli, provjerite AOP 868. Ako je njegov iznos stvarno toliki, zanemarite ovu kontrolu.",null,0,0,null,null,null,null,null,{"$f":"IF(AND(PRRAS!D508>0,PRRAS!D882=0),1,0)","v":0},{"$f":"IF(AND(PRRAS!E508>0,PRRAS!E882=0),1,0)","v":0},null,null,null,null,null,null,null,36811]
[230,"O.K.","Ako je iznos na AOP-u 516 veći od nule, a iznos na AOP-u 883 (ostali tuzemni vrijednosni papiri - dugoročni) je jednak nuli, provjerite AOP 883. Ako je njegov iznos stvarno toliki, zanemarite ovu kontrolu.",null,0,0,null,null,null,null,null,{"$f":"IF(AND(PRRAS!D529>0,PRRAS!D897=0),1,0)","v":0},{"$f":"IF(AND(PRRAS!E529>0,PRRAS!E897=0),1,0)","v":0},null,null,null,null,null,null,null,36820]
[231,"O.K.","Ako je iznos na AOP-u 526 veći od nule, a suma iznosa na AOP-ima 884 i 885 je jednaka nuli, provjerite AOP-e 884 i 885. Ako je njihov iznos stvarno toliki, zanemarite ovu kontrolu.",null,0,0,null,null,null,null,null,{"$f":"IF(AND(PRRAS!D539>0,SUM(PRRAS!D898:D899)=0),1,0)","v":0},{"$f":"IF(AND(PRRAS!E539>0,SUM(PRRAS!E898:E899)=0),1,0)","v":0},null,null,null,null,null,null,null,36838]
[232,"O.K.","Ako je iznos na AOP-u 529 veći od nule, a suma iznosa na AOP-ima 886 i 887 je jednaka nuli, provjerite AOP-e 886 i 887. Ako je njihov iznos stvarno toliki, zanemarite ovu kontrolu.",null,0,0,null,null,null,null,null,{"$f":"IF(AND(PRRAS!D542>0,SUM(PRRAS!D900:D901)=0),1,0)","v":0},{"$f":"IF(AND(PRRAS!E542>0,SUM(PRRAS!E900:E901)=0),1,0)","v":0},null,null,null,null,null,null,null,36846]
[233,"O.K.","Ako je iznos na AOP-u 530 veći od nule, a suma iznosa na AOP-ima 888 i 889 je jednaka nuli, provjerite AOP-e 888 i 889. Ako je njihov iznos stvarno toliki, zanemarite ovu kontrolu.",null,0,0,null,null,null,null,null,{"$f":"IF(AND(PRRAS!D543>0,SUM(PRRAS!D902:D903)=0),1,0)","v":0},{"$f":"IF(AND(PRRAS!E543>0,SUM(PRRAS!E902:E903)=0),1,0)","v":0},null,null,null,null,null,null,null,36862]
[234,"O.K.","Ako je iznos na AOP-u 531 veći od nule, a suma iznosa na AOP-ima 890 i 891 je jednaka nuli, provjerite AOP-e 890 i 891. Ako je njihov iznos stvarno toliki, zanemarite ovu kontrolu.",null,0,0,null,null,null,null,null,{"$f":"IF(AND(PRRAS!D544>0,SUM(PRRAS!D904:D905)=0),1,0)","v":0},{"$f":"IF(AND(PRRAS!E544>0,SUM(PRRAS!E904:E905)=0),1,0)","v":0},null,null,null,null,null,null,null,36879]
[235,"O.K.","Ako je iznos na AOP-u 534 veći od nule, a suma iznosa na AOP-ima 895 i 896 je jednaka nuli, provjerite AOP-e 895 i 896. Ako je njihov iznos stvarno toliki, zanemarite ovu kontrolu.",null,0,0,null,null,null,null,null,{"$f":"IF(AND(PRRAS!D547>0,SUM(PRRAS!D909:D910)=0),1,0)","v":0},{"$f":"IF(AND(PRRAS!E547>0,SUM(PRRAS!E909:E910)=0),1,0)","v":0},null,null,null,null,null,null,null,36887]
[{"$f":"1+A241","v":236},"O.K.","Ako je iznos na AOP-u 535 veći od nule, a suma iznosa na AOP-ima 897 i 898 je jednaka nuli, provjerite AOP-e 897 i 898. Ako je njihov iznos stvarno toliki, zanemarite ovu kontrolu.",null,0,0,null,null,null,null,null,{"$f":"IF(AND(PRRAS!D548>0,SUM(PRRAS!D911:D912)=0),1,0)","v":0},{"$f":"IF(AND(PRRAS!E548>0,SUM(PRRAS!E911:E912)=0),1,0)","v":0},null,null,null,null,null,null,null,36895]
[237,"O.K.","Ako je iznos na AOP-u 536 veći od nule, a suma iznosa na AOP-ima 899 i 900 je jednaka nuli, provjerite AOP-e 899 i 900. Ako je njihov iznos stvarno toliki, zanemarite ovu kontrolu.",null,0,0,null,null,null,null,null,{"$f":"IF(AND(PRRAS!D549>0,SUM(PRRAS!D913:D914)=0),1,0)","v":0},{"$f":"IF(AND(PRRAS!E549>0,SUM(PRRAS!E913:E914)=0),1,0)","v":0},null,null,null,null,null,null,null,36900]
[238,"O.K.","Ako je iznos na AOP-u 585 veći od nule, a iznos na AOP-u 927 (otplata glavnice primljenih zajmova od međunarodnih organizacija - dugoročnih) je jednak nuli, provjerite AOP 927. Ako je njegov iznos stvarno toliki, zanemarite ovu kontrolu.",null,0,0,null,null,null,null,null,{"$f":"IF(AND(PRRAS!D598>0,PRRAS!D941=0),1,0)","v":0},{"$f":"IF(AND(PRRAS!E598>0,PRRAS!E941=0),1,0)","v":0},null,null,null,null,null,null,null,36926]
[239,"O.K.","Ako je iznos na AOP-u 586 veći od nule, a iznos na AOP-u 928 (otplata glavnice primljenih kredita i zajmova od institucija i tijela EU - dugoročnih) je jednak nuli, provjerite AOP 928. Ako je njegov iznos stvarno toliki, zanemarite ovu kontrolu.",null,0,0,null,null,null,null,null,{"$f":"IF(AND(PRRAS!D599>0,PRRAS!D942=0),1,0)","v":0},{"$f":"IF(AND(PRRAS!E599>0,PRRAS!E942=0),1,0)","v":0},null,null,null,null,null,null,null,36975]
[240,"O.K.","Ako je iznos na AOP-u 587 veći od nule, a iznos na AOP-u 929 (otplata glavnice primljenih zajmova od inozemnih vlada u \nEU-dugoročnih) je jednak nuli, provjerite AOP 929. Ako je njegov iznos stvarno toliki, zanemarite ovu kontrolu.",null,0,0,null,null,null,null,null,{"$f":"IF(AND(PRRAS!D600>0,PRRAS!D943=0),1,0)","v":0},{"$f":"IF(AND(PRRAS!E600>0,PRRAS!E943=0),1,0)","v":0},null,null,null,null,null,null,null,37009]
[241,"O.K.","Ako je iznos na AOP-u 588 veći od nule, a iznos na AOP-u 930 (otplata glavnice primljenih zajmova od inozemnih vlada izvan EU - dugoročnih) je jednak nuli, provjerite AOP 930. Ako je njegov iznos stvarno toliki, zanemarite ovu kontrolu.",null,0,0,null,null,null,null,null,{"$f":"IF(AND(PRRAS!D601>0,PRRAS!D944=0),1,0)","v":0},{"$f":"IF(AND(PRRAS!E601>0,PRRAS!E944=0),1,0)","v":0},null,null,null,null,null,null,null,37033]
[242,"O.K.","Ako je iznos na AOP-u 591 veći od nule, a iznos na AOP-u 934 (otplata glavnice primljenih zajmova od osiguravajućih društava u javnom sektoru - dugoročnih) je jednak nuli, provjerite AOP 934. Ako je njegov iznos stvarno toliki, zanemarite ovu kontrolu.",null,0,0,null,null,null,null,null,{"$f":"IF(AND(PRRAS!D604>0,PRRAS!D948=0),1,0)","v":0},{"$f":"IF(AND(PRRAS!E604>0,PRRAS!E948=0),1,0)","v":0},null,null,null,null,null,null,null,37041]
[243,"O.K.","Ako je iznos na AOP-u 592 veći od nule, a suma iznosa na AOP-ima 935 i 936 je jednaka nuli, provjerite AOP-e 935 i 936. Ako je njihov iznos stvarno toliki, zanemarite ovu kontrolu.",null,0,0,null,null,null,null,null,{"$f":"IF(AND(PRRAS!D605>0,SUM(PRRAS!D949:D950)=0),1,0)","v":0},{"$f":"IF(AND(PRRAS!E605>0,SUM(PRRAS!E949:E950)=0),1,0)","v":0},null,null,null,null,null,null,null,37050]
[244,"O.K.","Ako je iznos na AOP-u 594 veći od nule, a iznos na AOP-u 937 (otplata glavnice primljenih zajmova od trgovačkih društava u javnom sektoru - dugoročnih) je jednak nuli, provjerite AOP 937. Ako je njegov iznos stvarno toliki, zanemarite ovu kontrolu.",null,0,0,null,null,null,null,null,{"$f":"IF(AND(PRRAS!D607>0,PRRAS!D951=0),1,0)","v":0},{"$f":"IF(AND(PRRAS!E607>0,PRRAS!E951=0),1,0)","v":0},null,null,null,null,null,null,null,37084]
[245,"O.K.","Ako je iznos na AOP-u 597 veći od nule, a iznos na AOP-u 941 (otplata glavnice primljenih zajmova od tuzemnih osiguravajućih društava izvan javnog sektora - dugoročnih)je jednak nuli, provjerite AOP 941. Ako je njegov iznos stvarno toliki, zanemarite ovu kontrolu.",null,0,0,null,null,null,null,null,{"$f":"IF(AND(PRRAS!D610>0,PRRAS!D955=0),1,0)","v":0},{"$f":"IF(AND(PRRAS!E610>0,PRRAS!E955=0),1,0)","v":0},null,null,null,null,null,null,null,37105]
[246,"O.K.","Ako je iznos na AOP-u 598 veći od nule, a suma iznosa na AOP-ima 942 i 943 je jednaka nuli, provjerite AOP-e 942 i 943. Ako je njihov iznos stvarno toliki, zanemarite ovu kontrolu.",null,0,0,null,null,null,null,null,{"$f":"IF(AND(PRRAS!D611>0,SUM(PRRAS!D956:D957)=0),1,0)","v":0},{"$f":"IF(AND(PRRAS!E611>0,SUM(PRRAS!E956:E957)=0),1,0)","v":0},null,null,null,null,null,null,null,37121]
[247,"O.K.","Ako je iznos na AOP-u 600 veći od nule, a iznos na AOP-u 947 (otplata glavnice primljenih zajmova od inozemnih osiguravajućih društava - dugoročnih) je jednak nuli, provjerite AOP 947. Ako je njegov iznos stvarno toliki, zanemarite ovu kontrolu.",null,0,0,null,null,null,null,null,{"$f":"IF(AND(PRRAS!D613>0,PRRAS!D961=0),1,0)","v":0},{"$f":"IF(AND(PRRAS!E613>0,PRRAS!E961=0),1,0)","v":0},null,null,null,null,null,null,null,37130]
[248,"O.K.","Ako je iznos na AOP-u 601 veći od nule, a suma iznosa na AOP-ima 948 i 949 je jednaka nuli, provjerite AOP-e 948 i 949. Ako je njihov iznos stvarno toliki, zanemarite ovu kontrolu.",null,0,0,null,null,null,null,null,{"$f":"IF(AND(PRRAS!D614>0,SUM(PRRAS!D962:D963)=0),1,0)","v":0},{"$f":"IF(AND(PRRAS!E614>0,SUM(PRRAS!E962:E963)=0),1,0)","v":0},null,null,null,null,null,null,null,37164]
[249,"O.K.","Ako je iznos na AOP-u 603 veći od nule, a iznos na AOP-u 950 (otplata glavnice primljenih zajmova od tuzemnih trgovačkih društava izvan javnog sektora - dugoročnih) je jednak nuli, provjerite AOP 950 Ako je njegov iznos stvarno toliki, zanemarite ovu kontrolu.",null,0,0,null,null,null,null,null,{"$f":"IF(AND(PRRAS!D616>0,PRRAS!D964=0),1,0)","v":0},{"$f":"IF(AND(PRRAS!E616>0,PRRAS!E964=0),1,0)","v":0},null,null,null,null,null,null,null,37197]
[250,"O.K.","Ako je iznos na AOP-u 604 veći od nule, a iznos na AOP-u 951 (otplata glavnice primljenih zajmova od tuzemnih obrtnika - dugoročnih) je jednak nuli, provjerite AOP 951. Ako je njegov iznos stvarno toliki, zanemarite ovu kontrolu.",null,0,0,null,null,null,null,null,{"$f":"IF(AND(PRRAS!D617>0,PRRAS!D965=0),1,0)","v":0},{"$f":"IF(AND(PRRAS!E617>0,PRRAS!E965=0),1,0)","v":0},null,null,null,null,null,null,null,37201]
[251,"O.K.","Ako je iznos na AOP-u 605 veći od nule, a iznos na AOP-u 952 (otplata glavnice primljenih zajmova od inozemnih trgovačkih društava - dugoročnih) je jednak nuli, provjerite AOP 952. Ako je njegov iznos stvarno toliki, zanemarite ovu kontrolu.",null,0,0,null,null,null,null,null,{"$f":"IF(AND(PRRAS!D618>0,PRRAS!D966=0),1,0)","v":0},{"$f":"IF(AND(PRRAS!E618>0,PRRAS!E966=0),1,0)","v":0},null,null,null,null,null,null,null,37293]
[252,"O.K.","Ako je iznos na AOP-u 623 veći od nule, a iznos na AOP-u 967 (izdaci za otplatu glavnice za izdane ostale vrijednosne papire u zemlji - dugoročne) je jednak nuli, provjerite AOP 967. Ako je njegov iznos stvarno toliki, zanemarite ovu kontrolu.",null,0,0,null,null,null,null,null,{"$f":"IF(AND(PRRAS!D636>0,PRRAS!D981=0),1,0)","v":0},{"$f":"IF(AND(PRRAS!E636>0,PRRAS!E981=0),1,0)","v":0},null,null,null,null,null,null,null,37308]
[253,{"$f":"IF(E259=1,\"Pogreška\",IF(F259=1,\"Provjera\",\"O.K.\"))","v":"O.K."},"Kontrola upozorenja na popunjenost podataka o stanju na računu, priljevima i odljevima s računa. Kontrola upozorava ako su u nekoj koloni podataka stanja na računu i/ili priljevi te odljevi s računa nula što je vrlo malo vjerojatno. Popunite podatke ako ih niste popunili.",null,0,{"$f":"MAX(L259:O259)","v":0},null,null,null,null,null,{"$f":"IF(AND($J$3=\"DA\",MAX(PRRAS!D11:D650)>0,MAX(PRRAS!D652:D654)=0),1,0)","v":0},{"$f":"IF(AND($J$3=\"DA\",MAX(PRRAS!E11:E650)>0,MAX(PRRAS!E652:E654)=0),1,0)","v":0},null,null,null,null,null,null,null,37316]
[254,"O.K.","Kontrola na broj zaposlenih. Broj zaposlenih ni na jednoj od AOP oznaka 642 do 645 ne može biti iznad 100.000. Takav obrazac je u grešci. Osim toga, samo nekolicina obveznika mogu imati broj zaposlenih u tijelima veći od 10.000, a broj zaposlenih kod korisnika veći od 35.000. Oni su isključeni iz ove kontrole. Ostali obveznici su u grešci ako imaju na bilo kojoj poziciji broj zaposleni veći od ovoga. Osim ovoga, ova kontrola će javiti upozorenje ako je broj zaposlenih kod nekih od obveznika veći od 1.000. Upozorenje možete zanemariti ako je broj zaposlenih ispravno upisan.",null,{"$f":"MAX(G260:K260)","v":0},0,{"$f":"IF(AND(OR(MAX(PRRAS!D656:E656,PRRAS!D658:E658)>10000,MAX(PRRAS!D657:E657,PRRAS!D659:E659)>35000),O3<>174,O3<>713,O3<>1222, O3<>47107),1,0)","v":0},{"$f":"IF(MAX(PRRAS!D656:E659)>100000,1,0)","v":0},null,null,null,{"$f":"IF(MAX(PRRAS!D656:E659)>1000,1,0)","v":0},null,null,null,null,null,null,null,null,37324]
["Bilanca",null,null,null,{"$f":"SUM(E262:E287)","v":0},{"$f":"SUM(F262:F287)","v":0},null,null,null,null,null,null,null,null,null,null,null,null,null,null,37332]
[{"$f":"1+A260","v":255},{"$f":"IF(E262=1,\"Pogreška\",IF(F262=1,\"Provjera\",\"O.K.\"))","v":"O.K."},"Ovo je osnovna kontrola u Bilanci: Imovina = Obveze i vlastiti izvori (AOP 001 = AOP 162). Dopušteno je odstupanje od 1kn zbog zaokruživanja. Ako kontrola javlja pogrešku, znači da je razlika iznosa za ove dvije AOP oznake veća od 1. Ispravite podatke.",null,{"$f":"MAX(G262:K262)","v":0},{"$f":"MAX(L262:O262)","v":0},{"$f":"IF(ABS(Bil!D12-Bil!D173)>1,1,0)","v":0},{"$f":"IF(ABS(Bil!E12-Bil!E173)>1,1,0)","v":0},null,null,null,null,null,null,null,null,null,null,null,null,37349]
[{"$f":"1+A262","v":256},"O.K.","AOP oznake 233 i 237 ne mogu biti popunjene istovremeno ni u jednom stupcu obrasca",null,0,0,{"$f":"IF(AND(Bil!D244<>0,Bil!D248<>0),1,0)","v":0},{"$f":"IF(AND(Bil!E244<>0,Bil!E248<>0),1,0)","v":0},null,null,null,null,null,null,null,null,null,null,null,null,37412]
[{"$f":"1+A263","v":257},"O.K.","AOP oznake 234 i 238 ne mogu biti popunjene istovremeno ni u jednom stupcu obrasca",null,0,0,{"$f":"IF(AND(Bil!D245<>0,Bil!D249<>0),1,0)","v":0},{"$f":"IF(AND(Bil!E245<>0,Bil!E249<>0),1,0)","v":0},null,null,null,null,null,null,null,null,null,null,null,null,37620]
[258,"O.K.","Aop oznake 235 i 239 ne mogu biti popunjene istovremeno ni u jednom stupcu obrasca",null,0,0,{"$f":"IF(AND(Bil!D246<>0,Bil!D250<>0),1,0)","v":0},{"$f":"IF(AND(Bil!E246<>0,Bil!E250<>0),1,0)","v":0},null,null,null,null,null,null,null,null,null,null,null,null,37646]
[259,"O.K.","Samo AOP pozicije 224 i 225 mogu biti i negativne. Ako ova kontrola javlja pogrešku znači da je upisana negativna vrijednost u neku drugu AOP poziciju gdje to nije dopušteno.",null,0,0,{"$f":"IF(MIN(Bil!D12:E233,Bil!D236:E322)<0,1,0)","v":0},null,null,null,null,null,null,null,null,null,null,null,null,null,37662]
[260,"O.K.","Vrijednosti svih AOP oznaka moraju biti zaokružene, cjelobrojne vrijednosti, ako je vrijednost neke AOP oznake upisana s decimalama kontrola javlja pogrešku i takav obrazac je neispravan.",null,0,0,{"$f":"IF(SUM(Skriveni!H977:H1286)<>0,1,0)","v":0},null,null,null,null,null,null,null,null,null,null,null,null,null,37679]
[261,"O.K.","Vrijednost AOP oznake 262 mora biti manja ili jednaka vrijednosti AOP-a 087. Ako je AOP 262 veći kontrola javlja pogrešku.",null,0,0,{"$f":"IF(Bil!D274>Bil!D98,1,0)","v":0},{"$f":"IF(Bil!E274>Bil!E98,1,0)","v":0},null,null,null,null,null,null,null,null,null,null,null,null,37695]
[262,"O.K.","Vrijednost AOP oznake 263 mora biti manja ili jednaka vrijednosti AOP-a 088. Ako je AOP 263 veći kontrola javlja grešku.",null,0,0,{"$f":"IF(Bil!D275>Bil!D99,1,0)","v":0},{"$f":"IF(Bil!E275>Bil!E99,1,0)","v":0},null,null,null,null,null,null,null,null,null,null,null,null,37814]
[263,"O.K.","Vrijednost AOP oznake 264 moram biti manja ili jednaka vrijednosti AOP-a 089. AKO je AOP 264 veći kontrola javlja grešku.",null,0,0,{"$f":"IF(Bil!D276>Bil!D100,1,0)","v":0},{"$f":"IF(Bil!E276>Bil!E100,1,0)","v":0},null,null,null,null,null,null,null,null,null,null,null,null,37935]
[264,"O.K.","Vrijednost AOP oznake 265 mora biti manja ili jednaka vrijednosti AOP-a 090. Ako je AOP 265 veći kontrola javlja grešku.",null,0,0,{"$f":"IF(Bil!D277>Bil!D101,1,0)","v":0},{"$f":"IF(Bil!E277>Bil!E101,1,0)","v":0},null,null,null,null,null,null,null,null,null,null,null,null,38001]
[265,"O.K.","Vrijednost AOP oznake 266 mora biti manja ili jednaka vrijednosti AOP-a 091. Ako je AOP 266 veći kontrola javlja pogrešku.",null,{"$f":"MAX(G272:K272)","v":0},{"$f":"MAX(L272:O272)","v":0},{"$f":"IF(Bil!D278>Bil!D102,1,0)","v":0},{"$f":"IF(Bil!E278>Bil!E102,1,0)","v":0},null,null,null,null,null,null,null,null,null,null,null,null,38331]
[266,"O.K.","Vrijednost AOP oznake 267 mora biti manja ili jednaka vrijednosti AOP-a 092. Ako je AOP 267 veći kontrola javlja pogrešku.",null,0,0,{"$f":"IF(Bil!D279>Bil!D103,1,0)","v":0},{"$f":"IF(Bil!E279>Bil!E103,1,0)","v":0},null,null,null,null,null,null,null,null,null,null,null,null,38340]
[267,"O.K.","Vrijednost AOP oznake 268 mora biti manja ili jednaka vrijednosti AOP-a 094. Ako je AOP 268 veći kontrola javlja pogrešku.",null,0,0,{"$f":"IF(Bil!D280>Bil!D105,1,0)","v":0},{"$f":"IF(Bil!E280>Bil!E105,1,0)","v":0},null,null,null,null,null,null,null,null,null,null,null,null,38366]
[268,"O.K.","Vrijednost AOP oznake 269 mora biti manja ili jednaka vrijednosti AOP-a 095. Ako je AOP 269 veći kontrola javlja pogrešku.",null,0,0,{"$f":"IF(Bil!D281>Bil!D106,1,0)","v":0},{"$f":"IF(Bil!E281>Bil!E106,1,0)","v":0},null,null,null,null,null,null,null,null,null,null,null,null,38374]
[269,"O.K.","Vrijednost AOP oznake 270 mora biti manja ili jednaka vrijednosti AOP-a 096. Ako je AOP 270 veći kontrola javlja pogrešku.",null,0,0,{"$f":"IF(Bil!D282>Bil!D107,1,0)","v":0},{"$f":"IF(Bil!E282>Bil!E107,1,0)","v":0},null,null,null,null,null,null,null,null,null,null,null,null,40834]
[270,"O.K.","Vrijednost AOP oznake 271 mora biti manja ili jednaka vrijednosti AOP-a 097. Ako je AOP 271 veći kontrola javlja pogrešku.",null,0,0,{"$f":"IF(Bil!D283>Bil!D108,1,0)","v":0},{"$f":"IF(Bil!E283>Bil!E108,1,0)","v":0},null,null,null,null,null,null,null,null,null,null,null,null,42362]
[271,"O.K.","Vrijednost AOP oznake 272 mora biti manja ili jednaka vrijednosti AOP-a 098. Ako je AOP 272 veći kontrola javlja pogrešku.",null,0,0,{"$f":"IF(Bil!D284>Bil!D109,1,0)","v":0},{"$f":"IF(Bil!E279>Bil!E109,1,0)","v":0},null,null,null,null,null,null,null,null,null,null,null,null,42379]
[272,"O.K.","Vrijednost AOP oznake 273 mora biti manja ili jednaka vrijednosti AOP-a 099. Ako je AOP 273 veći kontrola javlja pogrešku.",null,0,0,{"$f":"IF(Bil!D285>Bil!D110,1,0)","v":0},{"$f":"IF(Bil!E285>Bil!E110,1,0)","v":0},null,null,null,null,null,null,null,null,null,null,null,null,42434]
[273,"O.K.","Vrijednost AOP oznake 274 mora biti manja ili jednaka vrijednosti AOP-a 154. Ako je AOP 274 veći kontrola javlja grešku.",null,{"$f":"MAX(G280:K280)","v":0},{"$f":"MAX(L280:O280)","v":0},{"$f":"IF(Bil!D286>Bil!D165,1,0)","v":0},{"$f":"IF(Bil!E286>Bil!E165,1,0)","v":0},null,null,null,null,null,null,null,null,null,null,null,null,42539]
[274,"O.K.","AOP 081 mora biti jednak zbroju AOP-a: 246+247 u oba stupca podataka. Dopušteno je odstupanje od 1kn zbog zaokruživanja.",null,{"$f":"MAX(G281:K281)","v":0},{"$f":"MAX(L281:O281)","v":0},{"$f":"IF(ABS(Bil!D92-Bil!D258-Bil!D259)>1,1,0)","v":0},{"$f":"IF(ABS(Bil!E92-Bil!E258-Bil!E259)>1,1,0)","v":0},null,null,null,null,null,null,null,null,null,null,null,null,42619]
[275,"O.K.","AOP 140 mora biti jednak zbroju AOP-a: 248+249 u oba stupca podataka. Dopušteno je odstupanje od 1kn zbog zaokruživanja.",null,0,0,{"$f":"IF(ABS(Bil!D151-Bil!D260-Bil!D261)>1,1,0)","v":0},{"$f":"IF(ABS(Bil!E151-Bil!E260-Bil!E261)>1,1,0)","v":0},null,null,null,null,null,null,null,null,null,null,null,null,42750]
[276,"O.K.","AOP 157 mora biti jednak zbroju AOP-a: 250+251 u oba stupca podataka. Dopušteno je odstupanje od 1kn zbog zaokruživanja.",null,0,0,{"$f":"IF(ABS(Bil!D168-Bil!D262-Bil!D263)>1,1,0)","v":0},{"$f":"IF(ABS(Bil!E168-Bil!E262-Bil!E263)>1,1,0)","v":0},null,null,null,null,null,null,null,null,null,null,null,null,42768]
[277,"O.K.","AOP 164 mora biti jednak zbroju AOP-a: 275+276 u oba stupca podataka. Dopušteno je odstupanje od 1kn zbog zaokruživanja.",null,0,0,{"$f":"IF(ABS(Bil!D175-Bil!D287-Bil!D288)>1,1,0)","v":0},{"$f":"IF(ABS(Bil!E175-Bil!E287-Bil!E288)>1,1,0)","v":0},null,null,null,null,null,null,null,null,null,null,null,null,43214]
[278,"O.K.","AOP 175 mora biti jednak zbroju AOP-a: 277+278 u oba stupca podataka. Dopušteno je odstupanje od 1kn zbog zaokruživanja.",null,0,0,{"$f":"IF(ABS(Bil!D186-Bil!D289-Bil!D290)>1,1,0)","v":0},{"$f":"IF(ABS(Bil!E186-Bil!E289-Bil!E290)>1,1,0)","v":0},null,null,null,null,null,null,null,null,null,null,null,null,43564]
[279,"O.K.","AOP 176 mora biti jednak zbroju AOP-a: 279+280 u oba stupca podataka. Dopušteno je odstupanje od 1kn zbog zaokruživanja.",null,0,0,{"$f":"IF(ABS(Bil!D187-Bil!D291-Bil!D292)>1,1,0)","v":0},{"$f":"IF(ABS(Bil!E187-Bil!E291-Bil!E292)>1,1,0)","v":0},null,null,null,null,null,null,null,null,null,null,null,null,46270]
[280,"O.K.","AOP 192 mora biti jednak zbroju AOP-a: 281+282 u oba stupca podataka. Dopušteno je odstupanje od 1kn zbog zaokruživanja.",null,0,0,{"$f":"IF(ABS(Bil!D203-Bil!D293-Bil!D294)>1,1,0)","v":0},{"$f":"IF(ABS(Bil!E203-Bil!E293-Bil!E294)>1,1,0)","v":0},null,null,null,null,null,null,null,null,null,null,null,null,47334]
["Obveze",null,null,null,{"$f":"SUM(E289:E291)","v":0},{"$f":"SUM(F289:F291)","v":0},null,null,null,null,null,null,null,null,null,null,null,null,null,null,47359]
[{"$f":"A287+1","v":281},{"$f":"IF(E289=1,\"Pogreška\",IF(F289=1,\"Provjera\",\"O.K.\"))","v":"O.K."},"Vrijednosti svih AOP oznaka moraju biti zaokružene, cjelobrojne vrijednosti, ako je vrijednost neke AOP oznake upisana s decimalama kontrola javlja pogrešku i takav obrazac je neispravan.",null,{"$f":"MAX(G289:K289)","v":0},{"$f":"MAX(L289:O289)","v":0},{"$f":"IF(SUM(Skriveni!H1468:H1561)=0,0,1)","v":0},null,null,null,null,null,null,null,null,null,null,null,null,null,47852]
[{"$f":"A289+1","v":282},{"$f":"IF(E290=1,\"Pogreška\",IF(F290=1,\"Provjera\",\"O.K.\"))","v":"O.K."},"Ako ova kontrola javlja pogrešku znači da je na nekoj od AOP pozicija upisana negativna vrijednost. Ovaj obrazac ne može sadržavati niti jednu negativnu vrijednost.",null,{"$f":"MAX(G290:K290)","v":0},{"$f":"MAX(L290:O290)","v":0},{"$f":"IF(MIN(Skriveni!C1468:C1561)<0,1,0)","v":0},null,null,null,null,null,null,null,null,null,null,null,null,null,47932]
[{"$f":"A290+1","v":283},{"$f":"IF(E291=1,\"Pogreška\",IF(F291=1,\"Provjera\",\"O.K.\"))","v":"O.K."},"Mora biti zadovoljena i kontrola: AOP 036 = 037+090 ili drukčije rečeno, ukupno stanje svih obveza na kraju razdoblja (AOP 036) mora biti jednako zbroju dospjelih obveza (AOP 037) i nedospjelih obveza (AOP 090). Dopušteno je odstupanje od najviše 1 kune zbog zaokruživanja.",null,{"$f":"MAX(G291:K291)","v":0},{"$f":"MAX(L291:O291)","v":0},{"$f":"IF(ABS(Obv!D47-Obv!D48-Obv!D101)>1,1,0)","v":0},null,null,null,null,null,null,null,null,null,null,null,null,null,48226]
["P-VRIO",null,null,null,{"$f":"SUM(E293:E296)","v":0},{"$f":"SUM(F293:F296)","v":0},null,null,null,null,null,null,null,null,null,null,null,null,null,null,49585]
[{"$f":"A291+1","v":284},{"$f":"IF(E293=1,\"Pogreška\",IF(F293=1,\"Provjera\",\"O.K.\"))","v":"O.K."},"Vrijednosti svih AOP oznaka moraju biti zaokružene, cjelobrojne vrijednosti, ako je vrijednost neke AOP oznake upisana s decimalama kontrola javlja pogrešku i takav obrazac je neispravan.",null,{"$f":"MAX(G293:K293)","v":0},{"$f":"MAX(L293:O293)","v":0},{"$f":"IF(SUM(Skriveni!H1424:H1467)=0,0,1)","v":0},null,null,null,null,null,null,null,null,null,null,null,null,null,49593]
[{"$f":"A293+1","v":285},{"$f":"IF(E294=1,\"Pogreška\",IF(F294=1,\"Provjera\",\"O.K.\"))","v":"O.K."},"Ako ova kontrola javlja pogrešku znači da je na nekoj od AOP pozicija upisana negativna vrijednost. Ovaj obrazac ne može sadržavati niti jednu negativnu vrijednost.",null,{"$f":"MAX(G294:K294)","v":0},{"$f":"MAX(L294:O294)","v":0},{"$f":"IF(MIN(Skriveni!H1424:H1467)<0,1,0)","v":0},null,null,null,null,null,null,null,null,null,null,null,null,null,49608]
[{"$f":"A294+1","v":286},{"$f":"IF(E295=1,\"Pogreška\",IF(F295=1,\"Provjera\",\"O.K.\"))","v":"O.K."},"Vrijednost svake AOP oznake koja nije sumarna može imati upisan samo iznos povećanja ili iznos smanjenja (ne mogu oba stupca biti popunjena istovremeno). Ako je neka AOP oznaka popunjena u oba stupca, obrazac je u grešci.",null,{"$f":"MAX(G295:K295)","v":0},{"$f":"MAX(L295:O295)","v":0},{"$f":"IF(SUM(Skriveni!I1424:I1467)>0,1,0)","v":0},null,null,null,null,null,null,null,null,null,null,null,null,null,99999]
[{"$f":"A295+1","v":287},{"$f":"IF(E296=1,\"Pogreška\",IF(F296=1,\"Provjera\",\"O.K.\"))","v":"O.K."},"S obzirom da se ovaj obrazac može predati i prazan (bez ikakvih iznosa), oznaka popunjenosti na referentnoj stranici ne ažurira se automatski kao kod ostalih obrazaca, ako ste ovaj obrazac popunili, ili ga predajete nepopunjenog (nema promjena na vrijednosti imovine i obveza), a dužni ste ga predati, na Referentnoj stranici potrebno je ručno označiti \"DA\", tj. da predajete i obrazac P-VRIO. Kontrola javlja grešku ako je u bilo koju poziciju upisan iznos a nije označeno \"DA\" na referentnoj stranici. Isto tako, kontrola javlja upozorenje ako je obveznik dužan popuniti ovaj obrazac, a on nije popunjen, tj. nije označeno \"DA\" na Referentnoj stranici.",null,{"$f":"MAX(G296:K296)","v":0},{"$f":"MAX(L296:O296)","v":0},{"$f":"IF(AND(MAX(Skriveni!C1424:C1467)>0,RefStr!B31<>\"DA\"),1,0)","v":0},null,null,null,null,{"$f":"IF(AND(H3=12,L3<>\"DA\"),1,0)","v":0}]
["RAS - funkcijski",null,null,null,{"$f":"SUM(E298:E299)","v":0},{"$f":"SUM(F298:F299)","v":0}]
[{"$f":"A296+1","v":288},{"$f":"IF(E298=1,\"Pogreška\",IF(F298=1,\"Provjera\",\"O.K.\"))","v":"O.K."},"Vrijednosti svih AOP oznaka moraju biti zaokružene, cjelobrojne vrijednosti, ako je vrijednost neke AOP oznake upisana s decimalama kontrola javlja pogrešku i takav obrazac je neispravan.",null,{"$f":"MAX(G298:K298)","v":0},{"$f":"MAX(L298:O298)","v":0},{"$f":"IF(SUM(Skriveni!H1287:H1423)<>0,1,0)","v":0}]
[{"$f":"A298+1","v":289},{"$f":"IF(E299=1,\"Pogreška\",IF(F299=1,\"Provjera\",\"O.K.\"))","v":"O.K."},"Ako ova kontrola javlja pogrešku znači da je na nekoj od AOP pozicija upisana negativna vrijednost. Ovaj obrazac ne može sadržavati niti jednu negativnu vrijednost.",null,{"$f":"MAX(G299:K299)","v":0},{"$f":"MAX(L299:O299)","v":0},{"$f":"IF(MIN(Skriveni!C1287:D1423)<0,1,0)","v":0}]

{"sheet":"Sifre","index":9,"n_rows":869,"n_cols":8,"rows_kept":869,"cut":false,"hidden":false,"merged":[[867,1,867,7],[868,1,868,7],[252,0,252,1],[252,2,252,4],[252,5,252,7],[863,1,863,7],[864,1,864,7],[865,1,865,7],[866,1,866,7],[859,1,859,7],[0,0,0,7],[201,0,201,1],[201,2,201,4],[201,5,201,7],[3,1,3,7],[4,1,4,7],[5,1,5,7],[6,1,6,7],[7,1,7,7],[8,1,8,7],[860,1,860,7],[861,1,861,7],[862,1,862,7],[851,1,851,7],[852,1,852,7],[853,1,853,7],[854,1,854,7],[855,1,855,7],[856,1,856,7],[857,1,857,7],[858,1,858,7],[843,1,843,7],[844,1,844,7],[845,1,845,7],[846,1,846,7],[847,1,847,7],[848,1,848,7],[849,1,849,7],[850,1,850,7],[835,1,835,7],[836,1,836,7],[837,1,837,7],[838,1,838,7],[839,1,839,7],[840,1,840,7],[841,1,841,7],[842,1,842,7],[827,1,827,7],[828,1,828,7],[829,1,829,7],[830,1,830,7],[831,1,831,7],[832,1,832,7],[833,1,833,7],[834,1,834,7],[819,1,819,7],[820,1,820,7],[821,1,821,7],[822,1,822,7],[823,1,823,7],[824,1,824,7],[825,1,825,7],[826,1,826,7],[811,1,811,7],[812,1,812,7],[813,1,813,7],[814,1,814,7],[815,1,815,7],[816,1,816,7],[817,1,817,7],[818,1,818,7],[803,1,803,7],[804,1,804,7],[805,1,805,7],[806,1,806,7],[807,1,807,7],[808,1,808,7],[809,1,809,7],[810,1,810,7],[795,1,795,7],[796,1,796,7],[797,1,797,7],[798,1,798,7],[799,1,799,7],[800,1,800,7],[801,1,801,7],[802,1,802,7],[787,1,787,7],[788,1,788,7],[789,1,789,7],[790,1,790,7],[791,1,791,7],[792,1,792,7],[793,1,793,7],[794,1,794,7],[779,1,779,7],[780,1,780,7],[781,1,781,7],[782,1,782,7],[783,1,783,7],[784,1,784,7],[785,1,785,7],[786,1,786,7],[771,1,771,7],[772,1,772,7],[773,1,773,7],[774,1,774,7],[775,1,775,7],[776,1,776,7],[777,1,777,7],[778,1,778,7],[763,1,763,7],[764,1,764,7],[765,1,765,7],[766,1,766,7],[767,1,767,7],[768,1,768,7],[769,1,769,7],[770,1,770,7],[755,1,755,7],[756,1,756,7],[757,1,757,7],[758,1,758,7],[759,1,759,7],[760,1,760,7],[761,1,761,7],[762,1,762,7],[747,1,747,7],[748,1,748,7],[749,1,749,7],[750,1,750,7],[751,1,751,7],[752,1,752,7],[753,1,753,7],[754,1,754,7],[739,1,739,7],[740,1,740,7],[741,1,741,7],[742,1,742,7],[743,1,743,7],[744,1,744,7],[745,1,745,7],[746,1,746,7],[731,1,731,7],[732,1,732,7],[733,1,733,7],[734,1,734,7],[735,1,735,7],[736,1,736,7],[737,1,737,7],[738,1,738,7],[723,1,723,7],[724,1,724,7],[725,1,725,7],[726,1,726,7],[727,1,727,7],[728,1,728,7],[729,1,729,7],[730,1,730,7],[715,1,715,7],[716,1,716,7],[717,1,717,7],[718,1,718,7],[719,1,719,7],[720,1,720,7],[721,1,721,7],[722,1,722,7],[707,1,707,7],[708,1,708,7],[709,1,709,7],[710,1,710,7],[711,1,711,7],[712,1,712,7],[713,1,713,7],[714,1,714,7],[699,1,699,7],[700,1,700,7],[701,1,701,7],[702,1,702,7],[703,1,703,7],[704,1,704,7],[705,1,705,7],[706,1,706,7],[691,1,691,7],[692,1,692,7],[693,1,693,7],[694,1,694,7],[695,1,695,7],[696,1,696,7],[697,1,697,7],[698,1,698,7],[683,1,683,7],[684,1,684,7],[685,1,685,7],[686,1,686,7],[687,1,687,7],[688,1,688,7],[689,1,689,7],[690,1,690,7],[675,1,675,7],[676,1,676,7],[677,1,677,7],[678,1,678,7],[679,1,679,7],[680,1,680,7],[681,1,681,7],[682,1,682,7],[667,1,667,7],[668,1,668,7],[669,1,669,7],[670,1,670,7],[671,1,671,7],[672,1,672,7],[673,1,673,7],[674,1,674,7],[659,1,659,7],[660,1,660,7],[661,1,661,7],[662,1,662,7],[663,1,663,7],[664,1,664,7],[665,1,665,7],[666,1,666,7],[651,1,651,7],[652,1,652,7],[653,1,653,7],[654,1,654,7],[655,1,655,7],[656,1,656,7],[657,1,657,7],[658,1,658,7],[643,1,643,7],[644,1,644,7],[645,1,645,7],[646,1,646,7],[647,1,647,7],[648,1,648,7],[649,1,649,7],[650,1,650,7],[635,1,635,7],[636,1,636,7],[637,1,637,7],[638,1,638,7],[639,1,639,7],[640,1,640,7],[641,1,641,7],[642,1,642,7],[627,1,627,7],[628,1,628,7],[629,1,629,7],[630,1,630,7],[631,1,631,7],[632,1,632,7],[633,1,633,7],[634,1,634,7],[619,1,619,7],[620,1,620,7],[621,1,621,7],[622,1,622,7],[623,1,623,7],[624,1,624,7],[625,1,625,7],[626,1,626,7],[611,1,611,7],[612,1,612,7],[613,1,613,7],[614,1,614,7],[615,1,615,7],[616,1,616,7],[617,1,617,7],[618,1,618,7],[603,1,603,7],[604,1,604,7],[605,1,605,7],[606,1,606,7],[607,1,607,7],[608,1,608,7],[609,1,609,7],[610,1,610,7],[595,1,595,7],[596,1,596,7],[597,1,597,7],[598,1,598,7],[599,1,599,7],[600,1,600,7],[601,1,601,7],[602,1,602,7],[587,1,587,7],[588,1,588,7],[589,1,589,7],[590,1,590,7],[591,1,591,7],[592,1,592,7],[593,1,593,7],[594,1,594,7],[579,1,579,7],[580,1,580,7],[581,1,581,7],[582,1,582,7],[583,1,583,7],[584,1,584,7],[585,1,585,7],[586,1,586,7],[571,1,571,7],[572,1,572,7],[573,1,573,7],[574,1,574,7],[575,1,575,7],[576,1,576,7],[577,1,577,7],[578,1,578,7],[563,1,563,7],[564,1,564,7],[565,1,565,7],[566,1,566,7],[567,1,567,7],[568,1,568,7],[569,1,569,7],[570,1,570,7],[555,1,555,7],[556,1,556,7],[557,1,557,7],[558,1,558,7],[559,1,559,7],[560,1,560,7],[561,1,561,7],[562,1,562,7],[547,1,547,7],[548,1,548,7],[549,1,549,7],[550,1,550,7],[551,1,551,7],[552,1,552,7],[553,1,553,7],[554,1,554,7],[539,1,539,7],[540,1,540,7],[541,1,541,7],[542,1,542,7],[543,1,543,7],[544,1,544,7],[545,1,545,7],[546,1,546,7],[531,1,531,7],[532,1,532,7],[533,1,533,7],[534,1,534,7],[535,1,535,7],[536,1,536,7],[537,1,537,7],[538,1,538,7],[523,1,523,7],[524,1,524,7],[525,1,525,7],[526,1,526,7],[527,1,527,7],[528,1,528,7],[529,1,529,7],[530,1,530,7],[515,1,515,7],[516,1,516,7],[517,1,517,7],[518,1,518,7],[519,1,519,7],[520,1,520,7],[521,1,521,7],[522,1,522,7],[507,1,507,7],[508,1,508,7],[509,1,509,7],[510,1,510,7],[511,1,511,7],[512,1,512,7],[513,1,513,7],[514,1,514,7],[499,1,499,7],[500,1,500,7],[501,1,501,7],[502,1,502,7],[503,1,503,7],[504,1,504,7],[505,1,505,7],[506,1,506,7],[491,1,491,7],[492,1,492,7],[493,1,493,7],[494,1,494,7],[495,1,495,7],[496,1,496,7],[497,1,497,7],[498,1,498,7],[483,1,483,7],[484,1,484,7],[485,1,485,7],[486,1,486,7],[487,1,487,7],[488,1,488,7],[489,1,489,7],[490,1,490,7],[475,1,475,7],[476,1,476,7],[477,1,477,7],[478,1,478,7],[479,1,479,7],[480,1,480,7],[481,1,481,7],[482,1,482,7],[467,1,467,7],[468,1,468,7],[469,1,469,7],[470,1,470,7],[471,1,471,7],[472,1,472,7],[473,1,473,7],[474,1,474,7],[459,1,459,7],[460,1,460,7],[461,1,461,7],[462,1,462,7],[463,1,463,7],[464,1,464,7],[465,1,465,7],[466,1,466,7],[451,1,451,7],[452,1,452,7],[453,1,453,7],[454,1,454,7],[455,1,455,7],[456,1,456,7],[457,1,457,7],[458,1,458,7],[443,1,443,7],[444,1,444,7],[445,1,445,7],[446,1,446,7],[447,1,447,7],[448,1,448,7],[449,1,449,7],[450,1,450,7],[435,1,435,7],[436,1,436,7],[437,1,437,7],[438,1,438,7],[439,1,439,7],[440,1,440,7],[441,1,441,7],[442,1,442,7],[427,1,427,7],[428,1,428,7],[429,1,429,7],[430,1,430,7],[431,1,431,7],[432,1,432,7],[433,1,433,7],[434,1,434,7],[419,1,419,7],[420,1,420,7],[421,1,421,7],[422,1,422,7],[423,1,423,7],[424,1,424,7],[425,1,425,7],[426,1,426,7],[411,1,411,7],[412,1,412,7],[413,1,413,7],[414,1,414,7],[415,1,415,7],[416,1,416,7],[417,1,417,7],[418,1,418,7],[403,1,403,7],[404,1,404,7],[405,1,405,7],[406,1,406,7],[407,1,407,7],[408,1,408,7],[409,1,409,7],[410,1,410,7],[395,1,395,7],[396,1,396,7],[397,1,397,7],[398,1,398,7],[399,1,399,7],[400,1,400,7],[401,1,401,7],[402,1,402,7],[387,1,387,7],[388,1,388,7],[389,1,389,7],[390,1,390,7],[391,1,391,7],[392,1,392,7],[393,1,393,7],[394,1,394,7],[379,1,379,7],[380,1,380,7],[381,1,381,7],[382,1,382,7],[383,1,383,7],[384,1,384,7],[385,1,385,7],[386,1,386,7],[371,1,371,7],[372,1,372,7],[373,1,373,7],[374,1,374,7],[375,1,375,7],[376,1,376,7],[377,1,377,7],[378,1,378,7],[363,1,363,7],[364,1,364,7],[365,1,365,7],[366,1,366,7],[367,1,367,7],[368,1,368,7],[369,1,369,7],[370,1,370,7],[355,1,355,7],[356,1,356,7],[357,1,357,7],[358,1,358,7],[359,1,359,7],[360,1,360,7],[361,1,361,7],[362,1,362,7],[347,1,347,7],[348,1,348,7],[349,1,349,7],[350,1,350,7],[351,1,351,7],[352,1,352,7],[353,1,353,7],[354,1,354,7],[339,1,339,7],[340,1,340,7],[341,1,341,7],[342,1,342,7],[343,1,343,7],[344,1,344,7],[345,1,345,7],[346,1,346,7],[331,1,331,7],[332,1,332,7],[333,1,333,7],[334,1,334,7],[335,1,335,7],[336,1,336,7],[337,1,337,7],[338,1,338,7],[323,1,323,7],[324,1,324,7],[325,1,325,7],[326,1,326,7],[327,1,327,7],[328,1,328,7],[329,1,329,7],[330,1,330,7],[315,1,315,7],[316,1,316,7],[317,1,317,7],[318,1,318,7],[319,1,319,7],[320,1,320,7],[321,1,321,7],[322,1,322,7],[307,1,307,7],[308,1,308,7],[309,1,309,7],[310,1,310,7],[311,1,311,7],[312,1,312,7],[313,1,313,7],[314,1,314,7],[299,1,299,7],[300,1,300,7],[301,1,301,7],[302,1,302,7],[303,1,303,7],[304,1,304,7],[305,1,305,7],[306,1,306,7],[291,1,291,7],[292,1,292,7],[293,1,293,7],[294,1,294,7],[295,1,295,7],[296,1,296,7],[297,1,297,7],[298,1,298,7],[283,1,283,7],[284,1,284,7],[285,1,285,7],[286,1,286,7],[287,1,287,7],[288,1,288,7],[289,1,289,7],[290,1,290,7],[275,1,275,7],[276,1,276,7],[277,1,277,7],[278,1,278,7],[279,1,279,7],[280,1,280,7],[281,1,281,7],[282,1,282,7],[267,1,267,7],[268,1,268,7],[269,1,269,7],[270,1,270,7],[271,1,271,7],[272,1,272,7],[273,1,273,7],[274,1,274,7],[265,1,265,7],[266,1,266,7],[259,1,259,7],[260,1,260,7],[261,1,261,7],[262,1,262,7],[253,1,253,7],[254,1,254,7],[263,1,263,7],[264,1,264,7],[255,1,255,7],[256,1,256,7],[257,1,257,7],[258,1,258,7],[202,1,202,7],[1,0,1,7],[12,0,12,7],[9,1,9,7],[10,1,10,7],[2,1,2,7]]}
["<–––– Povratak na Referentnu stranicu"]
["S obzirom na objedinjavanje svih obrazaca proračuna i proračunskih korisnika u jednu datoteku, kako bi se smanjio broj radnih listova u Excel datoteci oznake razina, šifre gradova/općina, šifre djelatnosti i popis razdjela spojeni su u ovaj jedan radni list. Šifrarnici su dani u nastavku jedan iza drugoga."]
["Oznaka","Značenje oznake razine"]
[11,"Proračunski korisnik državnog proračuna i glava unutar nadležnog ministarstva;"]
[12,"Nadježno ministarstvo/razdjel - konsolidirani izvještaj;"]
[21,"Proračunski korisnik jedinice lokalne i područne (regionalne) samouprave;"]
[22,"Proračun jedinice lokalne i područne (regionalne) samouprave;"]
[23,"Konsolidirani proračun jedinice lokalne i područne (regionalne) samouprave;"]
[31,"Proračunski korisnik jedinice lokalne i područne (regionalne) samouprave koji obavlja poslove u sklopu funkcija koje se decentraliziraju"]
[41,"Izvanproračunski korisnik državnog proračuna"]
[42,"Izvanproračunski korisnik jedinice lokalne i područne (regionalne) samouprave"]
[]
["Šifra općine / grada upisuje se prema standardnim troznamenkastim šiframa bez kontrolne znamekne. U ovom šifrarniku šifre su dane abecednim redom naziva naselja. U obrazac se upisuje samo šifra općine / grada, a šifra županije se automatski izračunava."]
["Šifra","Naziv općine /  grada",null,"Šifra","Naziv općine /  grada",null,"Šifra","Naziv općine /  grada"]
[1,"Andrijaševci",null,185,"Klakar",null,88,"Proložac"]
[2,"Antunovac",null,186,"Klana",null,298,"Promina"]
[3,"Babina Greda",null,187,"Klanjec",null,358,"Pučišća"]
[4,"Bakar",null,189,"Klenovnik",null,359,"Pula"]
[5,"Bale",null,190,"Klinča Sela",null,360,"Punat"]
[6,"Barban",null,192,"Klis",null,361,"Punitovci"]
[7,"Barilovići",null,193,"Kloštar Ivanić",null,362,"Pušća"]
[8,"Baška",null,194,"Kloštar Podravski",null,363,"Rab"]
[9,"Baška Voda",null,195,"Kneževi Vinogradi",null,364,"Radoboj"]
[10,"Bebrina",null,196,"Knin",null,536,"Rakovec"]
[11,"Bedekovčina",null,622,"Kolan",null,365,"Rakovica"]
[550,"Bedenica",null,197,"Komiža",null,366,"Rasinja"]
[12,"Bednja",null,198,"Konavle",null,368,"Raša"]
[13,"Beli Manastir",null,199,"Končanica",null,369,"Ravna Gora"]
[15,"Belica",null,200,"Konjščina",null,371,"Ražanac"]
[16,"Belišće",null,201,"Koprivnica",null,372,"Rešetari"]
[17,"Benkovac",null,202,"Koprivnički Bregi",null,556,"Ribnik"]
[18,"Berek",null,203,"Koprivnički Ivanec",null,373,"Rijeka"]
[19,"Beretinec",null,204,"Korčula",null,582,"Rogoznica"]
[20,"Bibinje",null,538,"Kostrena",null,374,"Rovinj"]
[621,"Bilice",null,205,"Koška",null,375,"Rovišće"]
[21,"Bilje",null,206,"Kotoriba",null,376,"Rugvica"]
[22,"Biograd na Moru",null,208,"Kraljevec na Sutli",null,591,"Runovići"]
[310,"Biskupija",null,209,"Kraljevica",null,377,"Ružić"]
[547,"Bistra",null,211,"Krapina",null,378,"Saborsko"]
[23,"Bizovac",null,212,"Krapinske Toplice",null,379,"Sali"]
[24,"Bjelovar",null,533,"Krašić",null,380,"Samobor"]
[25,"Blato",null,545,"Kravarsko",null,381,"Satnica Đakovačka"]
[26,"Bogdanovci",null,213,"Križ",null,382,"Seget"]
[27,"Bol",null,214,"Križevci",null,383,"Selca"]
[29,"Borovo",null,215,"Krk",null,385,"Selnica"]
[30,"Bosiljevo",null,216,"Krnjak",null,386,"Semeljci"]
[32,"Bošnjaci",null,217,"Kršan",null,387,"Senj"]
[33,"Brckovljani",null,572,"Kukljica",null,562,"Severin"]
[34,"Brdovec",null,219,"Kula Norinska",null,388,"Sibinj"]
[77,"Brela",null,553,"Kumrovec",null,570,"Sikirevci"]
[35,"Brestovac",null,220,"Kutina",null,389,"Sinj"]
[36,"Breznica",null,221,"Kutjevo",null,390,"Sirač"]
[151,"Breznički Hum",null,222,"Labin",null,391,"Sisak"]
[37,"Brinje",null,223,"Lanišće",null,393,"Skrad"]
[38,"Brod Moravice",null,225,"Lasinja",null,394,"Skradin"]
[39,"Brodski Stupnik",null,226,"Lastovo",null,395,"Slatina"]
[40,"Brtonigla",null,586,"Lećevica",null,396,"Slavonski Brod"]
[41,"Budinščina",null,227,"Legrad",null,397,"Slavonski Šamac"]
[42,"Buje",null,228,"Lekenik",null,399,"Slivno"]
[567,"Bukovlje",null,229,"Lepoglava",null,400,"Slunj"]
[43,"Buzet",null,230,"Levanjska Varoš",null,402,"Smokvica"]
[44,"Cerna",null,231,"Lipik",null,405,"Sokolovac"]
[46,"Cernik",null,232,"Lipovljani",null,406,"Solin"]
[47,"Cerovlje",null,234,"Lišane Ostrovičke",null,407,"Sopje"]
[48,"Cestica",null,235,"Ližnjan",null,409,"Split"]
[49,"Cetingrad",null,236,"Lobor",null,410,"Sračinec"]
[50,"Cista Provo",null,237,"Lokve",null,411,"Stankovci"]
[51,"Civljane",null,587,"Lokvičići",null,412,"Stara Gradiška"]
[52,"Cres",null,624,"Lopar",null,413,"Stari Grad"]
[53,"Crikvenica",null,239,"Lovas",null,414,"Stari Jankovci"]
[54,"Crnac",null,240,"Lovinac",null,415,"Stari Mikanovci"]
[55,"Čabar",null,242,"Lovran",null,416,"Starigrad"]
[56,"Čačinci",null,243,"Lovreć",null,418,"Staro Petrovo Selo"]
[57,"Čađavica",null,244,"Ludbreg",null,419,"Ston"]
[58,"Čaglin",null,548,"Luka",null,606,"Strahoninec"]
[60,"Čakovec",null,245,"Lukač",null,421,"Strizivojna"]
[61,"Čavle",null,600,"Lumbarda",null,422,"Stubičke Toplice"]
[63,"Čazma",null,246,"Lupoglav",null,551,"Stupnik"]
[64,"Čeminac",null,247,"Ljubešćica",null,423,"Sućuraj"]
[65,"Čepin",null,248,"Mače",null,424,"Suhopolje"]
[66,"Darda",null,578,"Magadenovac",null,425,"Sukošan"]
[67,"Daruvar",null,555,"Majur",null,426,"Sunja"]
[68,"Davor",null,249,"Makarska",null,427,"Supetar"]
[603,"Dekanovec",null,250,"Mala Subotica",null,592,"Sutivan"]
[69,"Delnice",null,251,"Mali Bukovec",null,607,"Sveta Marija"]
[70,"Desinić",null,252,"Mali Lošinj",null,432,"Sveta Nedelja"]
[71,"Dežanovac",null,253,"Malinska-Dubašnica",null,436,"Sveta Nedelja"]
[72,"Dicmo",null,254,"Marčana",null,437,"Sveti Đurđ"]
[74,"Dobrinj",null,256,"Marija Bistrica",null,428,"Sveti Filip i Jakov"]
[75,"Domašinec",null,539,"Marija Gorica",null,438,"Sveti Ilija"]
[78,"Donja Dubrava",null,257,"Marijanci",null,429,"Sveti Ivan Zelina"]
[576,"Donja Motičina",null,258,"Marina",null,439,"Sveti Ivan Žabno"]
[79,"Donja Stubica",null,610,"Markušica",null,440,"Sveti Juraj na Bregu"]
[80,"Donja Voća",null,259,"Martinska Ves",null,430,"Sveti Križ Začretje"]
[81,"Donji Andrijevci",null,260,"Maruševec",null,431,"Sveti Lovreč"]
[82,"Donji Kraljevec",null,261,"Matulji",null,441,"Sveti Martin na Muri"]
[83,"Donji Kukuruzari",null,263,"Medulin",null,442,"Sveti Petar Orehovec"]
[84,"Donji Lapac",null,264,"Metković",null,433,"Sveti Petar u Šumi"]
[85,"Donji Martijanec",null,265,"Mihovljan",null,435,"Svetvinčenat"]
[86,"Donji Miholjac",null,266,"Mikleuš",null,564,"Šandrovac"]
[89,"Donji Vidovec",null,267,"Milna",null,608,"Šenkovec"]
[568,"Dragalić",null,268,"Mljet",null,443,"Šestanovac"]
[90,"Draganić",null,270,"Molve",null,444,"Šibenik"]
[91,"Draž",null,273,"Mošćenička Draga",null,445,"Škabrnje"]
[92,"Drenovci",null,274,"Motovun",null,614,"Šodolovci"]
[94,"Drenje",null,275,"Mrkopalj",null,447,"Šolta"]
[95,"Drniš",null,87,"Muć",null,449,"Špišić Bukovica"]
[96,"Drnje",null,276,"Mursko Središće",null,450,"Štefanje"]
[97,"Dubrava",null,617,"Murter",null,628,"Štitar"]
[549,"Dubravica",null,278,"Našice",null,452,"Štrigova"]
[598,"Dubrovačko Primorje",null,279,"Nedelišće",null,631,"Tar-Vabriga"]
[98,"Dubrovnik",null,612,"Negoslavci",null,453,"Tinjan"]
[99,"Duga Resa",null,280,"Nerežišća",null,454,"Tisno"]
[100,"Dugi Rat",null,281,"Netretić",null,575,"Tkon"]
[101,"Dugo Selo",null,295,"Nijemci",null,456,"Tompojevci"]
[585,"Dugopolje",null,282,"Nin",null,457,"Topusko"]
[102,"Dvor",null,283,"Nova Bukovica",null,458,"Tordinci"]
[103,"Đakovo",null,284,"Nova Gradiška",null,557,"Tounj"]
[104,"Đelekovec",null,285,"Nova Kapela",null,459,"Tovarnik"]
[105,"Đulovac",null,287,"Nova Rača",null,626,"Tribunj"]
[106,"Đurđenovac",null,288,"Novalja",null,460,"Trilj"]
[107,"Đurđevac",null,554,"Novi Golubovec",null,461,"Trnava"]
[108,"Đurmanec",null,289,"Novi Marof",null,462,"Trnovec Bartolovečki"]
[110,"Erdut",null,290,"Novi Vinodolski",null,463,"Trogir"]
[111,"Ernestinovo",null,537,"Novigrad",null,601,"Trpanj"]
[113,"Ervenik",null,291,"Novigrad",null,464,"Trpinja"]
[114,"Farkaševac",null,292,"Novigrad Podravski",null,593,"Tučepi"]
[619,"Fažana",null,561,"Novo Virje",null,466,"Tuhelj"]
[115,"Ferdinandovac",null,293,"Novska",null,467,"Udbina"]
[116,"Feričanci",null,294,"Nuštar",null,468,"Umag"]
[629,"Funtana",null,296,"Obrovac",null,469,"Unešić"]
[117,"Fužine",null,297,"Ogulin",null,471,"Valpovo"]
[571,"Galovac",null,588,"Okrug",null,472,"Varaždin"]
[118,"Garčin",null,299,"Okučani",null,473,"Varaždinske Toplice"]
[119,"Garešnica",null,300,"Omiš",null,474,"Vela Luka"]
[120,"Generalski Stol",null,301,"Omišalj",null,475,"Velika"]
[121,"Glina",null,302,"Opatija",null,541,"Velika Gorica"]
[122,"Gola",null,303,"Oprisavci",null,476,"Velika Kopanica"]
[123,"Goričan",null,304,"Oprtalj",null,477,"Velika Ludina"]
[124,"Gorjani",null,306,"Opuzen",null,478,"Velika Pisanica"]
[618,"Gornja Reka",null,307,"Orahovica",null,565,"Velika Trnovitica"]
[125,"Gornja Stubica",null,308,"Orebić",null,558,"Veliki Bukovec"]
[569,"Gornja Vrba",null,605,"Orehovica",null,480,"Veliki Grđevac"]
[127,"Gornji Bogićevci",null,309,"Oriovac",null,481,"Veliko Trgovišće"]
[129,"Gornji Kneginec",null,542,"Orle",null,483,"Veliko Trojstvo"]
[604,"Gornji Mihaljevec",null,311,"Oroslavje",null,484,"Vidovec"]
[130,"Gospić",null,312,"Osijek",null,485,"Viljevo"]
[131,"Gračac",null,313,"Otočac",null,486,"Vinica"]
[132,"Gračišće",null,314,"Otok",null,487,"Vinkovci"]
[134,"Gradac",null,535,"Otok (Vinkovci)",null,488,"Vinodolska Općina"]
[135,"Gradec",null,315,"Ozalj",null,489,"Vir"]
[136,"Gradina",null,316,"Pag",null,490,"Virje"]
[137,"Gradište",null,317,"Pakoštane",null,491,"Virovitica"]
[138,"Grožnjan",null,318,"Pakrac",null,492,"Vis"]
[139,"Grubišno Polje",null,320,"Pašman",null,493,"Visoko"]
[140,"Gundinci",null,321,"Pazin",null,494,"Viškovci"]
[141,"Gunja",null,323,"Perušić",null,495,"Viškovo"]
[510,"Gvozd",null,324,"Peteranec",null,497,"Višnjan"]
[144,"Hercegovac",null,325,"Petlovac",null,498,"Vižinada"]
[145,"Hlebine",null,326,"Petrijanec",null,579,"Vladislavci"]
[146,"Hrašćina",null,327,"Petrijevci",null,499,"Voćin"]
[148,"Hrvace",null,328,"Petrinja",null,500,"Vodice"]
[149,"Hrvatska Dubica",null,329,"Petrovsko",null,502,"Vodnjan"]
[150,"Hrvatska Kostajnica",null,330,"Pićan",null,584,"Vođinci"]
[152,"Hum Na Sutli",null,581,"Pirovac",null,503,"Vojnić"]
[153,"Hvar",null,331,"Pisarovina",null,504,"Vratišinec"]
[154,"Ilok",null,332,"Pitomača",null,505,"Vrbanja"]
[155,"Imotski",null,333,"Plaški",null,506,"Vrbje"]
[156,"Ivanec",null,334,"Pleternica",null,507,"Vrbnik"]
[158,"Ivanić-Grad",null,455,"Plitvička Jezera",null,508,"Vrbovec"]
[159,"Ivankovo",null,335,"Ploče",null,509,"Vrbovsko"]
[161,"Ivanska",null,337,"Podbablje",null,511,"Vrgorac"]
[609,"Jagodnjak",null,338,"Podcrkavlje",null,512,"Vrhovine"]
[163,"Jakovlje",null,339,"Podgora",null,513,"Vrlika"]
[164,"Jakšić",null,340,"Podgorač",null,514,"Vrpolje"]
[165,"Jalžabet",null,271,"Podravska Moslavina",null,516,"Vrsar"]
[599,"Janjina",null,616,"Podravske Sesvete",null,625,"Vrsi"]
[166,"Jarmina",null,341,"Podstrana",null,517,"Vuka"]
[167,"Jasenice",null,342,"Podturen",null,518,"Vukovar"]
[168,"Jasenovac",null,343,"Pojezerje",null,519,"Zabok"]
[169,"Jastrebarsko",null,544,"Pokupsko",null,520,"Zadar"]
[170,"Jelenje",null,344,"Polača",null,595,"Zadvarje"]
[171,"Jelsa",null,345,"Poličnik",null,521,"Zagorska Sela"]
[552,"Jesenje",null,346,"Popovac",null,133,"Zagreb"]
[172,"Josipdol",null,347,"Popovača",null,522,"Zagvozd"]
[173,"Kali",null,348,"Poreč",null,543,"Zaprešić"]
[559,"Kalinovac",null,349,"Posedarje",null,523,"Zažablje"]
[560,"Kalnik",null,350,"Postira",null,524,"Zdenci"]
[623,"Kamanje",null,573,"Povljana",null,525,"Zemunik Donji"]
[175,"Kanfanar",null,351,"Požega",null,526,"Zlatar"]
[176,"Kapela",null,352,"Pregrada",null,527,"Zlatar-Bistrica"]
[177,"Kaptol",null,354,"Preko",null,528,"Zmijavci"]
[178,"Karlobag",null,355,"Prelog",null,566,"Zrinski Topolovac"]
[179,"Karlovac",null,356,"Preseka",null,530,"Žakanje"]
[596,"Karojba",null,589,"Prgomet",null,531,"Žminj"]
[180,"Kastav",null,620,"Pribislavec",null,540,"Žumberak"]
[181,"Kaštela",null,590,"Primorski Dolac",null,602,"Župa Dubrovačka"]
[597,"Kaštelir - Labinci",null,357,"Primošten",null,534,"Županja"]
[183,"Kijevo",null,583,"Privlaka"]
[184,"Kistanje",null,574,"Privlaka"]
[]
["Šifarnik razdjela",null,"<–––– Povratak na Referentnu stranicu",null,null,"<–––– Povratak na vrh lista"]
["Razdjel","Opis oznake razdjela"]
[10,"HRVATSKI SABOR"]
[12,"DRŽAVNO IZBORNO POVJERENSTVO REPUBLIKE HRVATSKE"]
[15,"URED PREDSJEDNICE REPUBLIKE HRVATSKE"]
[17,"USTAVNI SUD REPUBLIKE HRVATSKE"]
[18,"AGENCIJA ZA ZAŠTITU TRŽIŠNOG NATJECANJA"]
[20,"VLADA REPUBLIKE HRVATSKE"]
[25,"MINISTARSTVO FINANCIJA"]
[27,"RH SIGURNOSNO-OBAVJEŠTAJNA AGENCIJA"]
[28,"DRŽAVNI URED ZA SREDIŠNJU JAVNU NABAVU"]
[30,"MINISTARSTVO OBRANE"]
[32,"DRŽAVNI URED ZA HRVATE IZVAN REPUBLIKE HRVATSKE"]
[33,"DRŽAVNI URED ZA OBNOVU I STAMBENO ZBRINJAVANJE"]
[34,"SREDIŠNJI DRŽAVNI URED ZA RAZVOJ DIGITALNOG DRUŠTVA"]
[36,"SREDIŠNJI DRŽAVNI URED ZA ŠPORT"]
[40,"MINISTARSTVO UNUTARNJIH POSLOVA"]
[41,"MINISTARSTVO HRVATSKIH BRANITELJA"]
[48,"MINISTARSTVO VANJSKIH I EUROPSKIH POSLOVA"]
[49,"MINISTARSTVO GOSPODARSTVA, PODUZETNIŠTVA I OBRTA"]
[52,"POVJERENSTVO ZA ODLUČIVANJE O SUKOBU INTERESA"]
[54,"MINISTARSTVO DRŽAVNE IMOVINE"]
[55,"MINISTARSTVO KULTURE"]
[60,"MINISTARSTVO POLJOPRIVREDE"]
[61,"MINISTARSTVO REGIONALNOGA RAZVOJA I FONDOVA EUROPSKE UNIJE"]
[65,"MINISTARSTVO MORA, PROMETA I INFRASTRUKTURE"]
[76,"MINISTARSTVO GRADITELJSTVA I PROSTORNOGA UREĐENJA"]
[77,"MINISTARSTVO ZAŠTITE OKOLIŠA I ENERGETIKE"]
[80,"MINISTARSTVO ZNANOSTI I OBRAZOVANJA"]
[86,"MINISTARSTVO RADA I MIROVINSKOGA SUSTAVA"]
[90,"MINISTARSTVO TURIZMA"]
[95,"MINISTARSTVO UPRAVE"]
[96,"MINISTARSTVO ZDRAVSTVA"]
[102,"MINISTARSTVO ZA DEMOGRAFIJU, OBITELJ, MLADE I SOC. POLITIKU"]
[106,"HRVATSKA AKADEMIJA ZNANOSTI I UMJETNOSTI"]
[110,"MINISTARSTVO PRAVOSUĐA"]
[120,"URED PUČKOG PRAVOBRANITELJA"]
[121,"PRAVOBRANITELJ ZA DJECU"]
[122,"PRAVOBRANITELJ/ICA ZA RAVNOPRAVNOST SPOLOVA"]
[123,"PRAVOBRANITELJ ZA OSOBE S INVALIDITETOM"]
[160,"DRŽAVNI ZAVOD ZA STATISTIKU"]
[185,"DRŽAVNI URED ZA REVIZIJU"]
[196,"DRŽAVNA KOMISIJA ZA KONTROLU POSTUPAKA JAVNE NABAVE"]
[240,"URED VIJEĆA ZA NACIONALNU SIGURNOST"]
[241,"OPERATIVNO-TEHNIČKI CENTAR ZA NADZOR TELEKOMUNIKACIJA"]
[242,"ZAVOD ZA SIGURNOST INFORMACIJSKIH SUSTAVA"]
[250,"AGENCIJA ZA ZAŠTITU OSOBNIH PODATAKA"]
[256,"DRŽAVNI ZAVOD ZA RADIOLOŠKU I NUKLEARNU SIGURNOST"]
[258,"POVJERENIK ZA INFORMIRANJE"]
[]
[]
["Šifarnik djelatnosti",null,"<–––– Povratak na Referentnu stranicu",null,null,"<–––– Povratak na vrh lista"]
["Šifra","Opis šifre djelatnosti (prema NKD2007)"]
[111,"Uzgoj žitarica (osim riže), mahunarki i uljanog sjemenja"]
[112,"Uzgoj riže"]
[113,"Uzgoj povrća, dinja i lubenica, korjenastog i gomoljastog povrća"]
[114,"Uzgoj šećerne trske"]
[115,"Uzgoj duhana"]
[116,"Uzgoj predivog bilja "]
[119,"Uzgoj ostalih jednogodišnjih usjeva "]
[121,"Uzgoj grožđa "]
[122,"Uzgoj tropskog i suptropskog voća"]
[123,"Uzgoj agruma"]
[124,"Uzgoj jezgričavog i koštuničavog voća"]
[125,"Uzgoj bobičastog, orašastog i ostalog voća "]
[126,"Uzgoj uljanih plodova"]
[127,"Uzgoj usjeva za pripremanje napitaka"]
[128,"Uzgoj bilja za uporabu u farmaciji, aromatskog, začinskog i ljekovitog bilja "]
[129,"Uzgoj ostalih višegodišnjih usjeva "]
[130,"Uzgoj sadnog materijala i ukrasnog bilja"]
[141,"Uzgoj muznih krava"]
[142,"Uzgoj ostalih goveda i bivola"]
[143,"Uzgoj konja, magaraca, mula i mazgi"]
[144,"Uzgoj deva i ljama"]
[145,"Uzgoj ovaca i koza"]
[146,"Uzgoj svinja"]
[147,"Uzgoj peradi"]
[149,"Uzgoj ostalih životinja"]
[150,"Mješovita proizvodnja"]
[161,"Pomoćne djelatnosti za uzgoj usjeva"]
[162,"Pomoćne djelatnosti za uzgoj životinja"]
[163,"Djelatnosti koje se obavljaju nakon žetve usjeva (priprema usjeva za primarna tržišta)"]
[164,"Dorada sjemena za sjemenski materijal"]
[170,"Lov, stupičarenje i uslužne djelatnosti povezane s njima"]
[210,"Uzgoj šuma i ostale djelatnosti u šumarstvu povezane s njime"]
[220,"Sječa drva "]
[230,"Skupljanje šumskih plodova i proizvoda, osim šumskih sortimenata"]
[240,"Pomoćne usluge u šumarstvu"]
[311,"Morski ribolov"]
[312,"Slatkovodni ribolov"]
[321,"Morska akvakultura"]
[322,"Slatkovodna akvakultura"]
[510,"Vađenje kamenog ugljena"]
[520,"Vađenje lignita"]
[610,"Vađenje sirove nafte "]
[620,"Vađenje prirodnog plina"]
[710,"Vađenje željeznih ruda"]
[721,"Vađenje uranovih i torijevih ruda"]
[729,"Vađenje ostalih ruda obojenih metala"]
[811,"Vađenje ukrasnoga kamena i kamena za gradnju, vapnenca, gipsa, krede i škriljevca"]
[812,"Djelatnosti šljunčara i pješčara; vađenje gline i kaolina"]
[891,"Vađenje minerala za kemikalije i gnojiva"]
[892,"Vađenje treseta"]
[893,"Vađenje soli"]
[899,"Vađenje ostalih ruda i kamena, d. n."]
[910,"Pomoćne djelatnosti za vađenje nafte i prirodnog plina"]
[990,"Pomoćne djelatnosti za ostalo rudarstvo i vađenje"]
[1011,"Prerada i konzerviranje mesa"]
[1012,"Prerada i konzerviranje mesa peradi"]
[1013,"Proizvodnja proizvoda od mesa i mesa peradi"]
[1020,"Prerada i konzerviranje riba, rakova i školjki "]
[1031,"Prerada i konzerviranje krumpira"]
[1032,"Proizvodnja sokova od voća i povrća"]
[1039,"Ostala prerada i konzerviranje voća i povrća"]
[1041,"Proizvodnja ulja i masti"]
[1042,"Proizvodnja margarina i sličnih jestivih masti"]
[1051,"Djelatnosti mljekara i proizvođača sira"]
[1052,"Proizvodnja sladoleda"]
[1061,"Proizvodnja mlinskih proizvoda"]
[1062,"Proizvodnja škroba i škrobnih proizvoda"]
[1071,"Proizvodnja kruha; proizvodnja svježih peciva, slastičarskih proizvoda i kolača"]
[1072,"Proizvodnja dvopeka, keksa i srodnih proizvoda; proizvodnja trajnih peciva, slastičarskih proizvoda i kolača"]
[1073,"Proizvodnja makarona, njoka, kuskusa i slične tjestenine"]
[1081,"Proizvodnja šećera"]
[1082,"Proizvodnja kakao, čokoladnih i bombonskih proizvoda"]
[1083,"Prerada čaja i kave"]
[1084,"Proizvodnja začina i drugih dodataka hrani"]
[1085,"Proizvodnja gotove hrane i jela"]
[1086,"Proizvodnja homogeniziranih prehrambenih pripravaka i dijetetske hrane"]
[1089,"Proizvodnja ostalih prehrambenih proizvoda, d. n. "]
[1091,"Proizvodnja pripremljene stočne hrane"]
[1092,"Proizvodnja pripremljene hrane za kućne ljubimce"]
[1101,"Destiliranje, pročišćavanje i miješanje alkoholnih pića"]
[1102,"Proizvodnja vina od grožđa"]
[1103,"Proizvodnja jabukovače i ostalih voćnih vina"]
[1104,"Proizvodnja ostalih nedestiliranih fermentiranih pića"]
[1105,"Proizvodnja piva"]
[1106,"Proizvodnja slada"]
[1107,"Proizvodnja osvježavajućih napitaka; proizvodnja mineralne i drugih flaširanih voda"]
[1200,"Proizvodnja duhanskih proizvoda"]
[1310,"Priprema i predenje tekstilnih vlakana"]
[1320,"Tkanje tekstila"]
[1330,"Dovršavanje tekstila"]
[1391,"Proizvodnja pletenih i kukičanih tkanina"]
[1392,"Proizvodnja gotovih tekstilnih proizvoda, osim odjeće"]
[1393,"Proizvodnja tepiha i sagova "]
[1394,"Proizvodnja užadi, konopaca, upletenoga konca i mreža"]
[1395,"Proizvodnja netkanog tekstila i proizvoda od netkanog tekstila, osim odjeće"]
[1396,"Proizvodnja ostaloga tehničkog i industrijskog tekstila"]
[1399,"Proizvodnja ostalog tekstila, d. n."]
[1411,"Proizvodnja kožne odjeće"]
[1412,"Proizvodnja radne odjeće "]
[1413,"Proizvodnja ostale vanjske odjeće"]
[1414,"Proizvodnja rublja"]
[1419,"Proizvodnja ostale odjeće i pribora za odjeću "]
[1420,"Proizvodnja proizvoda od krzna"]
[1431,"Proizvodnja pletenih i kukičanih čarapa"]
[1439,"Proizvodnja ostale pletene i kukičane odjeće"]
[1511,"Štavljenje i obrada kože; dorada i bojenje krzna"]
[1512,"Proizvodnja putnih i ručnih torba i slično, sedlarskih i remenarskih proizvoda"]
[1520,"Proizvodnja obuće"]
[1610,"Piljenje i blanjanje drva"]
[1621,"Proizvodnja furnira i ostalih ploča od drva"]
[1622,"Proizvodnja sastavljenog parketa"]
[1623,"Proizvodnja ostale građevne stolarije i elemenata"]
[1624,"Proizvodnja ambalaže od drva"]
[1629,"Proizvodnja ostalih proizvoda od drva, proizvoda od pluta, slame i pletarskih materijala"]
[1711,"Proizvodnja celuloze"]
[1712,"Proizvodnja papira i kartona"]
[1721,"Proizvodnja valovitog papira i kartona te ambalaže od papira i kartona"]
[1722,"Proizvodnja robe za kućanstvo i higijenu te toaletnih potrepština od papira"]
[1723,"Proizvodnja uredskog materijala od papira"]
[1724,"Proizvodnja zidnih tapeta"]
[1729,"Proizvodnja ostalih proizvoda od papira i kartona"]
[1811,"Tiskanje novina"]
[1812,"Ostalo tiskanje "]
[1813,"Usluge pripreme za tisak i objavljivanje"]
[1814,"Knjigoveške i srodne usluge "]
[1820,"Umnožavanje snimljenih zapisa"]
[1910,"Proizvodnja proizvoda koksnih peći"]
[1920,"Proizvodnja rafiniranih naftnih proizvoda"]
[2011,"Proizvodnja industrijskih plinova"]
[2012,"Proizvodnja koloranata i pigmenata"]
[2013,"Proizvodnja ostalih anorganskih osnovnih kemikalija"]
[2014,"Proizvodnja ostalih organskih osnovnih kemikalija"]
[2015,"Proizvodnja gnojiva i dušičnih spojeva"]
[2016,"Proizvodnja plastike u primarnim oblicima"]
[2017,"Proizvodnja sintetičkoga kaučuka u primarnim oblicima"]
[2020,"Proizvodnja pesticida i drugih agrokemijskih proizvoda"]
[2030,"Proizvodnja boja, lakova i sličnih premaza, grafičkih boja i kitova"]
[2041,"Proizvodnja sapuna i deterdženata, sredstava za čišćenje i poliranje"]
[2042,"Proizvodnja parfema i toaletno-kozmetičkih preparata"]
[2051,"Proizvodnja eksploziva"]
[2052,"Proizvodnja ljepila "]
[2053,"Proizvodnja eteričnih ulja"]
[2059,"Proizvodnja ostalih kemijskih proizvoda, d. n. "]
[2060,"Proizvodnja umjetnih vlakana"]
[2110,"Proizvodnja osnovnih farmaceutskih proizvoda"]
[2120,"Proizvodnja farmaceutskih pripravaka"]
[2211,"Proizvodnja vanjskih i unutrašnjih guma za vozila; protektiranje vanjskih guma"]
[2219,"Proizvodnja ostalih proizvoda od gume"]
[2221,"Proizvodnja ploča, listova, cijevi i profila od plastike"]
[2222,"Proizvodnja ambalaže od plastike"]
[2223,"Proizvodnja proizvoda od plastike za građevinarstvo"]
[2229,"Proizvodnja ostalih proizvoda od plastike"]
[2311,"Proizvodnja ravnog stakla"]
[2312,"Oblikovanje i obrada ravnog stakla"]
[2313,"Proizvodnja šupljeg stakla"]
[2314,"Proizvodnja staklenih vlakana"]
[2319,"Proizvodnja i obrada ostalog stakla uključujući tehničku robu od stakla"]
[2320,"Proizvodnja vatrostalnih proizvoda"]
[2331,"Proizvodnja keramičkih pločica i ploča"]
[2332,"Proizvodnja opeke, crijepa i ostalih proizvoda od pečene gline za građevinarstvo"]
[2341,"Proizvodnja keramičkih proizvoda za kućanstvo i ukrasnih predmeta"]
[2342,"Proizvodnja sanitarne keramike "]
[2343,"Proizvodnja keramičkih izolatora i izolacijskog pribora"]
[2344,"Proizvodnja ostalih tehničkih proizvoda od keramike"]
[2349,"Proizvodnja ostalih proizvoda od keramike"]
[2351,"Proizvodnja cementa"]
[2352,"Proizvodnja vapna i gipsa "]
[2361,"Proizvodnja proizvoda od betona za građevinarstvo"]
[2362,"Proizvodnja proizvoda od gipsa za građevinarstvo"]
[2363,"Proizvodnja gotove betonske smjese"]
[2364,"Proizvodnja žbuke"]
[2365,"Proizvodnja fibro-cementa"]
[2369,"Proizvodnja ostalih proizvoda od betona, cementa i gipsa "]
[2370,"Rezanje, oblikovanje i obrada kamena"]
[2391,"Proizvodnja brusnih proizvoda"]
[2399,"Proizvodnja ostalih nemetalnih mineralnih proizvoda, d. n."]
[2410,"Proizvodnja sirovog željeza, čelika i ferolegura"]
[2420,"Proizvodnja čeličnih cijevi i pribora"]
[2431,"Hladno vučenje šipki"]
[2432,"Hladno valjanje uskih vrpci"]
[2433,"Hladno oblikovanje i profiliranje "]
[2434,"Hladno vučenje žice"]
[2441,"Proizvodnja plemenitih metala"]
[2442,"Proizvodnja aluminija"]
[2443,"Proizvodnja olova, cinka i kositra"]
[2444,"Proizvodnja bakra"]
[2445,"Proizvodnja ostalih obojenih metala"]
[2446,"Obrada nuklearnoga goriva"]
[2451,"Lijevanje željeza"]
[2452,"Lijevanje čelika"]
[2453,"Lijevanje lakih metala"]
[2454,"Lijevanje ostalih obojenih metala"]
[2511,"Proizvodnja metalnih konstrukcija i njihovih dijelova"]
[2512,"Proizvodnja vrata i prozora od metala"]
[2521,"Proizvodnja radijatora i kotlova za centralno grijanje"]
[2529,"Proizvodnja ostalih metalnih cisterni, rezervoara i sličnih posuda "]
[2530,"Proizvodnja parnih kotlova, osim kotlova za centralno grijanje toplom vodom"]
[2540,"Proizvodnja oružja i streljiva"]
[2550,"Kovanje, prešanje, štancanje i valjanje metala; metalurgija praha"]
[2561,"Obrada i prevlačenje metala"]
[2562,"Strojna obrada metala"]
[2571,"Proizvodnja sječiva"]
[2572,"Proizvodnja brava i okova"]
[2573,"Proizvodnja alata"]
[2591,"Proizvodnja čeličnih bačava i sličnih posuda "]
[2592,"Proizvodnja ambalaže od lakih metala"]
[2593,"Proizvodnja proizvoda od žice, lanaca i opruga"]
[2594,"Proizvodnja zakovica i vijčane robe"]
[2599,"Proizvodnja ostalih gotovih proizvoda od metala, d. n."]
[2611,"Proizvodnja elektroničkih komponenata "]
[2612,"Proizvodnja punih elektroničkih ploča"]
[2620,"Proizvodnja računala i periferne opreme"]
[2630,"Proizvodnja komunikacijske opreme"]
[2640,"Proizvodnja elektroničkih uređaja za široku potrošnju"]
[2651,"Proizvodnja instrumenata i aparata za mjerenje, ispitivanje i navigaciju"]
[2652,"Proizvodnja satova "]
[2660,"Proizvodnja opreme za zračenje, elektromedicinske i elektroterapeutske opreme"]
[2670,"Proizvodnja optičkih instrumenata i fotografske opreme"]
[2680,"Proizvodnja magnetskih i optičkih medija"]
[2711,"Proizvodnja elektromotora, generatora i transformatora"]
[2712,"Proizvodnja uređaja za distribuciju i kontrolu električne energije"]
[2720,"Proizvodnja baterija i akumulatora"]
[2731,"Proizvodnja kablova od optičkih vlakana"]
[2732,"Proizvodnja ostalih elektroničkih i električnih žica i kablova"]
[2733,"Proizvodnja elektroinstalacijskog materijala"]
[2740,"Proizvodnja električne opreme za rasvjetu"]
[2751,"Proizvodnja električnih aparata za kućanstvo"]
[2752,"Proizvodnja neelektričnih aparata za kućanstvo"]
[2790,"Proizvodnja ostale električne opreme"]
[2811,"Proizvodnja motora i turbina, osim motora za zrakoplove i motorna vozila"]
[2812,"Proizvodnja hidrauličnih pogonskih uređaja"]
[2813,"Proizvodnja ostalih crpki i kompresora"]
[2814,"Proizvodnja ostalih slavina i ventila"]
[2815,"Proizvodnja ležajeva, prijenosnika te prijenosnih i pogonskih elemenata"]
[2821,"Proizvodnja peći i plamenika"]
[2822,"Proizvodnja uređaja za dizanje i prenošenje"]
[2823,"Proizvodnja uredskih strojeva i opreme (osim proizvodnje računala i periferne opreme)"]
[2824,"Proizvodnja mehaniziranoga ručnog alata"]
[2825,"Proizvodnja rashladne i ventilacijske opreme, osim za kućanstvo"]
[2829,"Proizvodnja ostalih strojeva za opće namjene, d. n."]
[2830,"Proizvodnja strojeva za poljoprivredu i šumarstvo"]
[2841,"Proizvodnja strojeva za obradu metala"]
[2849,"Proizvodnja ostalih alatnih strojeva"]
[2891,"Proizvodnja strojeva za metalurgiju"]
[2892,"Proizvodnja strojeva za rudnike, kamenolome i građevinarstvo"]
[2893,"Proizvodnja strojeva za industriju hrane, pića i duhana"]
[2894,"Proizvodnja strojeva za industriju tekstila, odjeće i kože"]
[2895,"Proizvodnja strojeva za industriju papira i kartona"]
[2896,"Proizvodnja strojeva za plastiku i gumu"]
[2899,"Proizvodnja ostalih strojeva za posebne namjene, d. n."]
[2910,"Proizvodnja motornih vozila"]
[2920,"Proizvodnja karoserija za motorna vozila, prikolica i poluprikolica"]
[2931,"Proizvodnja električne i elektroničke opreme za motorna vozila "]
[2932,"Proizvodnja ostalih dijelova i pribora za motorna vozila "]
[3011,"Gradnja brodova i plutajućih objekata"]
[3012,"Gradnja čamaca za razonodu i sportskih čamaca"]
[3020,"Proizvodnja željezničkih lokomotiva i tračničkih vozila"]
[3030,"Proizvodnja zrakoplova i svemirskih letjelica te srodnih prijevoznih sredstava i opreme"]
[3040,"Proizvodnja vojnih borbenih vozila"]
[3091,"Proizvodnja motocikala"]
[3092,"Proizvodnja bicikala i invalidskih kolica"]
[3099,"Proizvodnja ostalih prijevoznih sredstava, d. n. "]
[3101,"Proizvodnja namještaja za poslovne i prodajne prostore"]
[3102,"Proizvodnja kuhinjskog namještaja"]
[3103,"Proizvodnja madraca"]
[3109,"Proizvodnja ostalog namještaja"]
[3211,"Proizvodnja novca"]
[3212,"Proizvodnja nakita i srodnih proizvoda"]
[3213,"Proizvodnja imitacije nakita (bižuterije) i srodnih proizvoda"]
[3220,"Proizvodnja glazbenih instrumenata"]
[3230,"Proizvodnja sportske opreme"]
[3240,"Proizvodnja igara i igračaka"]
[3250,"Proizvodnja medicinskih i stomatoloških instrumenata i pribora"]
[3291,"Proizvodnja metla i četaka"]
[3299,"Ostala prerađivačka industrija, d. n. "]
[3311,"Popravak proizvoda od metala"]
[3312,"Popravak strojeva"]
[3313,"Popravak elektroničke i optičke opreme"]
[3314,"Popravak električne opreme"]
[3315,"Popravak i održavanje brodova i čamaca"]
[3316,"Popravak i održavanje zrakoplova i svemirskih letjelica"]
[3317,"Popravak i održavanje ostalih prijevoznih sredstava"]
[3319,"Popravak ostale opreme"]
[3320,"Instaliranje industrijskih strojeva i opreme"]
[3511,"Proizvodnja električne energije"]
[3512,"Prijenos električne energije"]
[3513,"Distribucija električne energije"]
[3514,"Trgovina električnom energijom"]
[3521,"Proizvodnja plina"]
[3522,"Distribucija plinovitih goriva distribucijskom mrežom"]
[3523,"Trgovina plinom distribucijskom mrežom"]
[3530,"Opskrba parom i klimatizacija"]
[3600,"Skupljanje, pročišćavanje i opskrba vodom"]
[3700,"Uklanjanje otpadnih voda"]
[3811,"Skupljanje neopasnog otpada"]
[3812,"Skupljanje opasnog otpada"]
[3821,"Obrada i zbrinjavanje neopasnog otpada"]
[3822,"Obrada i zbrinjavanje opasnog otpada"]
[3831,"Rastavljanje olupina"]
[3832,"Oporaba posebno izdvojenih materijala"]
[3900,"Djelatnosti sanacije okoliša te ostale djelatnosti gospodarenja otpadom"]
[4110,"Organizacija izvedbe projekata za zgrade"]
[4120,"Gradnja stambenih i nestambenih zgrada"]
[4211,"Gradnja cesta i autocesta"]
[4212,"Gradnja željezničkih pruga i podzemnih željeznica"]
[4213,"Gradnja mostova i tunela"]
[4221,"Gradnja cjevovoda za tekućine i plinove"]
[4222,"Gradnja vodova za električnu struju i telekomunikacije"]
[4291,"Gradnja vodnih građevina"]
[4299,"Gradnja ostalih građevina niskogradnje, d. n."]
[4311,"Uklanjanje građevina"]
[4312,"Pripremni radovi na gradilištu"]
[4313,"Pokusno bušenje i sondiranje terena za gradnju"]
[4321,"Elektroinstalacijski radovi"]
[4322,"Uvođenje instalacija vodovoda, kanalizacije i plina i instalacija za grijanje i klimatizaciju "]
[4329,"Ostali građevinski instalacijski radovi"]
[4331,"Fasadni i štukaturski radovi"]
[4332,"Ugradnja stolarije"]
[4333,"Postavljanje podnih i zidnih obloga"]
[4334,"Soboslikarski i staklarski radovi"]
[4339,"Ostali završni građevinski radovi"]
[4391,"Radovi na krovištu"]
[4399,"Ostale specijalizirane građevinske djelatnosti, d. n."]
[4511,"Trgovina automobilima i motornim vozilima lake kategorije "]
[4519,"Trgovina ostalim motornim vozilima"]
[4520,"Održavanje i popravak motornih vozila"]
[4531,"Trgovina na veliko dijelovima i priborom za motorna vozila "]
[4532,"Trgovina na malo dijelovima i priborom za motorna vozila"]
[4540,"Trgovina motociklima, dijelovima i priborom za motocikle te održavanje i popravak motocikala"]
[4611,"Posredovanje u trgovini poljoprivrednim sirovinama, živom stokom, tekstilnim sirovinama i poluproizvodima"]
[4612,"Posredovanje u trgovini gorivima, rudama, metalima i industrijskim kemijskim proizvodima"]
[4613,"Posredovanje u trgovini drvom i građevinskim materijalom"]
[4614,"Posredovanje u trgovini strojevima, industrijskom opremom, brodovima i zrakoplovima"]
[4615,"Posredovanje u trgovini namještajem, proizvodima za kućanstvo i željeznom robom"]
[4616,"Posredovanje u trgovini tekstilom, odjećom, krznom, obućom i kožnim proizvodima"]
[4617,"Posredovanje u trgovini hranom, pićima i duhanom"]
[4618,"Posredovanje u trgovini specijaliziranoj za određene proizvode"]
[4619,"Posredovanje u trgovini raznovrsnim proizvodima"]
[4621,"Trgovina na veliko žitaricama, sirovim duhanom, sjemenjem i stočnom hranom"]
[4622,"Trgovina na veliko cvijećem i sadnicama"]
[4623,"Trgovina na veliko živom stokom"]
[4624,"Trgovina na veliko sirovim i štavljenim kožama"]
[4631,"Trgovina na veliko voćem i povrćem"]
[4632,"Trgovina na veliko mesom i mesnim proizvodima"]
[4633,"Trgovina na veliko mlijekom, mliječnim proizvodima, jajima, jestivim uljima i mastima"]
[4634,"Trgovina na veliko pićima"]
[4635,"Trgovina na veliko duhanskim proizvodima"]
[4636,"Trgovina na veliko šećerom, čokoladom i bombonima"]
[4637,"Trgovina na veliko kavom, čajem, kakaom i začinima"]
[4638,"Trgovina na veliko ostalom hranom uključujući ribe, rakove i školjke"]
[4639,"Nespecijalizirana trgovina na veliko hranom, pićima i duhanskim proizvodima"]
[4641,"Trgovina na veliko tekstilom"]
[4642,"Trgovina na veliko odjećom i obućom"]
[4643,"Trgovina na veliko električnim aparatima za kućanstvo"]
[4644,"Trgovina na veliko porculanom, staklom i sredstvima za čišćenje"]
[4645,"Trgovina na veliko parfemima i kozmetikom"]
[4646,"Trgovina na veliko farmaceutskim proizvodima"]
[4647,"Trgovina na veliko namještajem, sagovima i opremom za rasvjetu"]
[4648,"Trgovina na veliko satovima i nakitom"]
[4649,"Trgovina na veliko ostalim proizvodima za kućanstvo"]
[4651,"Trgovina na veliko računalima, perifernom opremom i softverom"]
[4652,"Trgovina na veliko elektroničkim i telekomunikacijskim dijelovima i opremom"]
[4661,"Trgovina na veliko poljoprivrednim strojevima, opremom i priborom"]
[4662,"Trgovina na veliko alatnim strojevima"]
[4663,"Trgovina na veliko strojevima za rudnike i građevinarstvo"]
[4664,"Trgovina na veliko strojevima za tekstilnu industriju te strojevima za šivanje i pletenje"]
[4665,"Trgovina na veliko uredskim namještajem"]
[4666,"Trgovina na veliko ostalim uredskim strojevima i opremom"]
[4669,"Trgovina na veliko ostalim strojevima i opremom"]
[4671,"Trgovina na veliko krutim, tekućim i plinovitim gorivima i srodnim proizvodima"]
[4672,"Trgovina na veliko metalima i metalnim rudama"]
[4673,"Trgovina na veliko drvom, građevinskim materijalom i sanitarnom opremom"]
[4674,"Trgovina na veliko željeznom robom, instalacijskim materijalom i opremom za vodovod i grijanje"]
[4675,"Trgovina na veliko kemijskim proizvodima"]
[4676,"Trgovina na veliko ostalim poluproizvodima"]
[4677,"Trgovina na veliko ostacima i otpacima"]
[4690,"Nespecijalizirana trgovina na veliko "]
[4711,"Trgovina na malo u nespecijaliziranim prodavaonicama pretežno hranom, pićima i duhanskim proizvodima "]
[4719,"Ostala trgovina na malo u nespecijaliziranim prodavaonicama"]
[4721,"Trgovina na malo voćem i povrćem u specijaliziranim prodavaonicama"]
[4722,"Trgovina na malo mesom i mesnim proizvodima u specijaliziranim prodavaonicama"]
[4723,"Trgovina na malo ribama, rakovima i školjkama u specijaliziranim prodavaonicama"]
[4724,"Trgovina na malo kruhom, pecivom, kolačima, tjesteninama, bombonima i slatkišima u specijaliziranim prodavaonicama"]
[4725,"Trgovina na malo pićima u specijaliziranim prodavaonicama"]
[4726,"Trgovina na malo duhanskim proizvodima u specijaliziranim prodavaonicama"]
[4729,"Ostala trgovina na malo prehrambenim proizvodima u specijaliziranim prodavaonicama"]
[4730,"Trgovina na malo motornim gorivima i mazivima u specijaliziranim prodavaonicama"]
[4741,"Trgovina na malo računalima, perifernim jedinicama i softverom u specijaliziranim prodavaonicama"]
[4742,"Trgovina na malo telekomunikacijskom opremom u specijaliziranim prodavaonicama"]
[4743,"Trgovina na malo audio i videoopremom u specijaliziranim prodavaonicama"]
[4751,"Trgovina na malo tekstilom u specijaliziranim prodavaonicama"]
[4752,"Trgovina na malo željeznom robom, bojama i staklom u specijaliziranim prodavaonicama"]
[4753,"Trgovina na malo sagovima i prostiračima za pod, zidnim i podnim oblogama u specijaliziranim prodavaonicama"]
[4754,"Trgovina na malo električnim aparatima za kućanstvo u specijaliziranim prodavaonicama"]
[4759,"Trgovina na malo namještajem, opremom za rasvjetu i ostalim proizvodima za kućanstvo u specijaliziranim prodavaonicama"]
[4761,"Trgovina na malo knjigama u specijaliziranim prodavaonicama"]
[4762,"Trgovina na malo novinama, papirnatom robom i pisaćim priborom u specijaliziranim prodavaonicama"]
[4763,"Trgovina na malo glazbenim i videozapisima u specijaliziranim prodavaonicama"]
[4764,"Trgovina na malo sportskom opremom u specijaliziranim prodavaonicama"]
[4765,"Trgovina na malo igrama i igračkama u specijaliziranim prodavaonicama"]
[4771,"Trgovina na malo odjećom u specijaliziranim prodavaonicama"]
[4772,"Trgovina na malo obućom i proizvodima od kože "]
[4773,"Ljekarne "]
[4774,"Trgovina na malo medicinskim pripravcima i ortopedskim pomagalima u specijaliziranim prodavaonicama"]
[4775,"Trgovina na malo kozmetičkim i toaletnim proizvodima u specijaliziranim prodavaonicama"]
[4776,"Trgovina na malo cvijećem, sadnicama, sjemenjem, gnojivom, kućnim ljubimcima i hranom za kućne ljubimce u specijaliziranim prodavaonicama"]
[4777,"Trgovina na malo satovima i nakitom u specijaliziranim prodavaonicama"]
[4778,"Ostala trgovina na malo novom robom u specijaliziranim prodavaonicama"]
[4779,"Trgovina na malo rabljenom robom u specijaliziranim prodavaonicama"]
[4781,"Trgovina na malo hranom, pićima i duhanskim proizvodima na štandovima i tržnicama"]
[4782,"Trgovina na malo tekstilom, odjećom i obućom na štandovima i tržnicama"]
[4789,"Trgovina na malo ostalom robom na štandovima i tržnicama"]
[4791,"Trgovina na malo preko pošte ili interneta"]
[4799,"Ostala trgovina na malo izvan prodavaonica, štandova i tržnica"]
[4910,"Željeznički prijevoz putnika, međugradski"]
[4920,"Željeznički prijevoz robe"]
[4931,"Gradski i prigradski kopneni prijevoz putnika"]
[4932,"Taksi služba"]
[4939,"Ostali kopneni prijevoz putnika, d. n."]
[4941,"Cestovni prijevoz robe"]
[4942,"Usluge preseljenja"]
[4950,"Cjevovodni transport"]
[5010,"Pomorski i obalni prijevoz putnika"]
[5020,"Pomorski i obalni prijevoz robe"]
[5030,"Prijevoz putnika unutrašnjim vodenim putovima"]
[5040,"Prijevoz robe unutrašnjim vodenim putovima"]
[5110,"Zračni prijevoz putnika"]
[5121,"Zračni prijevoz robe"]
[5122,"Svemirski prijevoz"]
[5210,"Skladištenje robe"]
[5221,"Uslužne djelatnosti u vezi s kopnenim prijevozom"]
[5222,"Uslužne djelatnosti u vezi s vodenim prijevozom"]
[5223,"Uslužne djelatnosti u vezi sa zračnim prijevozom"]
[5224,"Prekrcaj tereta"]
[5229,"Ostale prateće djelatnosti u prijevozu"]
[5310,"Djelatnosti pružanja univerzalnih poštanskih usluga"]
[5320,"Djelatnosti pružanja ostalih poštanskih i kurirskih usluga"]
[5510,"Hoteli i sličan smještaj"]
[5520,"Odmarališta i slični objekti za kraći odmor"]
[5530,"Kampovi i prostori za kampiranje"]
[5590,"Ostali smještaj"]
[5610,"Djelatnosti restorana i ostalih objekata za pripremu i usluživanje hrane"]
[5621,"Djelatnosti keteringa"]
[5629,"Ostale djelatnosti pripreme i usluživanja hrane"]
[5630,"Djelatnosti pripreme i usluživanja pića"]
[5811,"Izdavanje knjiga"]
[5812,"Izdavanje imenika i popisa korisničkih adresa"]
[5813,"Izdavanje novina"]
[5814,"Izdavanje časopisa i periodičnih publikacija"]
[5819,"Ostala izdavačka djelatnost"]
[5821,"Izdavanje računalnih igara"]
[5829,"Izdavanje ostalog softvera"]
[5911,"Proizvodnja filmova, videofilmova i televizijskog programa"]
[5912,"Djelatnosti koje slijede nakon proizvodnje filmova, videofilmova i televizijskog programa"]
[5913,"Distribucija filmova, videofilmova i televizijskog programa"]
[5914,"Djelatnosti prikazivanja filmova"]
[5920,"Djelatnosti snimanja zvučnih zapisa i izdavanja glazbenih zapisa"]
[6010,"Emitiranje radijskog programa"]
[6020,"Emitiranje televizijskog programa"]
[6110,"Djelatnosti žičane telekomunikacije"]
[6120,"Djelatnosti bežične telekomunikacije"]
[6130,"Djelatnosti satelitske telekomunikacije"]
[6190,"Ostale telekomunikacijske djelatnosti"]
[6201,"Računalno programiranje"]
[6202,"Savjetovanje u vezi s računalima"]
[6203,"Upravljanje računalnom opremom i sustavom"]
[6209,"Ostale uslužne djelatnosti u vezi s informacijskom tehnologijom i računalima"]
[6311,"Obrada podataka, usluge poslužitelja i djelatnosti povezane s njima"]
[6312,"Internetski portali"]
[6391,"Djelatnosti novinskih agencija"]
[6399,"Ostale informacijske uslužne djelatnosti, d. n."]
[6411,"Središnje bankarstvo"]
[6419,"Ostalo novčarsko posredovanje"]
[6420,"Djelatnosti holding-društava"]
[6430,"Uzajamni fondovi (trustovi), ostali fondovi i slični financijski subjekti"]
[6491,"Financijski leasing"]
[6492,"Ostalo kreditno posredovanje"]
[6499,"Ostale financijske uslužne djelatnosti, osim osiguranja i mirovinskih fondova, d. n."]
[6511,"Životno osiguranje"]
[6512,"Ostalo osiguranje"]
[6520,"Reosiguranje"]
[6530,"Mirovinski fondovi"]
[6611,"Poslovanje financijskih tržišta"]
[6612,"Djelatnosti posredovanja u poslovanju vrijednosnim papirima i robnim ugovorima"]
[6619,"Ostale pomoćne djelatnosti kod financijskih usluga, osim osiguranja i mirovinskih fondova"]
[6621,"Procjena rizika i štete"]
[6622,"Djelatnosti agenata i posrednika osiguranja "]
[6629,"Ostale pomoćne djelatnosti u osiguranju i mirovinskim fondovima"]
[6630,"Djelatnosti upravljanja fondovima"]
[6810,"Kupnja i prodaja vlastitih nekretnina"]
[6820,"Iznajmljivanje i upravljanje vlastitim nekretninama ili nekretninama uzetim u zakup (leasing)"]
[6831,"Agencije za poslovanje nekretninama"]
[6832,"Upravljanje nekretninama uz naplatu ili na osnovi ugovora"]
[6910,"Pravne djelatnosti"]
[6920,"Računovodstvene, knjigovodstvene i revizijske djelatnosti; porezno savjetovanje"]
[7010,"Upravljačke djelatnosti"]
[7021,"Odnosi s javnošću i djelatnosti priopćivanja"]
[7022,"Savjetovanje u vezi s poslovanjem i ostalim upravljanjem"]
[7111,"Arhitektonske djelatnosti"]
[7112,"Inženjerstvo i s njim povezano tehničko savjetovanje"]
[7120,"Tehničko ispitivanje i analiza"]
[7211,"Istraživanje i eksperimentalni razvoj u biotehnologiji"]
[7219,"Ostalo istraživanje i eksperimentalni razvoj u prirodnim, tehničkim i tehnološkim znanostima"]
[7220,"Istraživanje i eksperimentalni razvoj u društvenim i humanističkim znanostima"]
[7311,"Agencije za promidžbu (reklamu i propagandu)"]
[7312,"Oglašavanje preko medija"]
[7320,"Istraživanje tržišta i ispitivanje javnoga mnijenja"]
[7410,"Specijalizirane dizajnerske djelatnosti"]
[7420,"Fotografske djelatnosti"]
[7430,"Prevoditeljske djelatnosti i usluge tumača"]
[7490,"Ostale stručne, znanstvene i tehničke djelatnosti, d. n."]
[7500,"Veterinarske djelatnosti"]
[7711,"Iznajmljivanje i davanje u zakup (leasing) automobila i motornih vozila lake kategorije"]
[7712,"Iznajmljivanje i davanje u zakup (leasing) kamiona "]
[7721,"Iznajmljivanje i davanje u zakup (lea­sing) opreme za rekreaciju i sport"]
[7722,"Iznajmljivanje videokaseta i diskova"]
[7729,"Iznajmljivanje i davanje u zakup (leasing) ostalih predmeta za osobnu uporabu i kućanstvo"]
[7731,"Iznajmljivanje i davanje u zakup (leasing) poljoprivrednih strojeva i opreme"]
[7732,"Iznajmljivanje i davanje u zakup (leasing) strojeva i opreme za građevinarstvo i inženjerstvo"]
[7733,"Iznajmljivanje i davanje u zakup (leasing) uredskih strojeva i opreme (uključujući računala)"]
[7734,"Iznajmljivanje i davanje u zakup (leasing) plovnih prijevoznih sredstava"]
[7735,"Iznajmljivanje i davanje u zakup (leasing) zračnih prijevoznih sredstava"]
[7739,"Iznajmljivanje i davanje u zakup (leasing) ostalih strojeva, opreme i materijalnih dobara, d. n."]
[7740,"Davanje u zakup (leasing) prava na uporabu intelektualnog vlasništva i sličnih proizvoda, osim radova koji su zaštićeni autorskim pravima"]
[7810,"Djelatnosti agencija za zapošljavanje"]
[7820,"Djelatnosti agencija za privremeno zapošljavanje"]
[7830,"Ostalo ustupanje ljudskih resursa"]
[7911,"Djelatnosti putničkih agencija"]
[7912,"Djelatnosti organizatora putovanja (turoperatora)"]
[7990,"Ostale rezervacijske usluge i djelatnosti povezane s njima"]
[8010,"Djelatnosti privatne zaštite"]
[8020,"Usluge zaštite uz pomoć sigurnosnih sustava"]
[8030,"Istražne djelatnosti"]
[8110,"Upravljanje zgradama"]
[8121,"Osnovno čišćenje zgrada"]
[8122,"Ostale djelatnosti čišćenja zgrada i objekata"]
[8129,"Ostale djelatnosti čišćenja"]
[8130,"Uslužne djelatnosti uređenja i održavanja krajolika"]
[8211,"Kombinirane uredske administrativne uslužne djelatnosti"]
[8219,"Fotokopiranje, priprema dokumenata i ostale specijalizirane uredske pomoćne djelatnosti"]
[8220,"Djelatnosti pozivnih centara"]
[8230,"Organizacija sastanaka i poslovnih sajmova"]
[8291,"Djelatnosti agencija za prikupljanje i naplatu računa te kreditnih ureda"]
[8292,"Djelatnosti pakiranja"]
[8299,"Ostale poslovne pomoćne uslužne djelatnosti, d. n."]
[8411,"Opće djelatnosti javne uprave"]
[8412,"Reguliranje djelatnosti subjekata koji pružaju zdravstvenu zaštitu, usluge u obrazovanju i kulturi i druge društvene usluge, osim obveznoga socijalnog osiguranja"]
[8413,"Reguliranje i poboljšavanje poslovanja u gospodarstvu"]
[8421,"Vanjski poslovi"]
[8422,"Poslovi obrane"]
[8423,"Sudske i pravosudne djelatnosti"]
[8424,"Poslovi javnog reda i sigurnosti"]
[8425,"Djelatnosti vatrogasne službe"]
[8430,"Djelatnosti obveznoga socijalnog osiguranja"]
[8510,"Predškolsko obrazovanje"]
[8520,"Osnovno obrazovanje"]
[8531,"Opće srednje obrazovanje"]
[8532,"Tehničko i strukovno srednje obrazovanje"]
[8541,"Obrazovanje nakon srednjeg koje nije visoko"]
[8542,"Visoko obrazovanje "]
[8551,"Obrazovanje i poučavanje u području sporta i rekreacije"]
[8552,"Obrazovanje i poučavanje u području kulture"]
[8553,"Djelatnosti vozačkih škola"]
[8559,"Ostalo obrazovanje i poučavanje, d. n."]
[8560,"Pomoćne uslužne djelatnosti u obrazovanju"]
[8610,"Djelatnosti bolnica"]
[8621,"Djelatnosti opće medicinske prakse"]
[8622,"Djelatnosti specijalističke medicinske prakse"]
[8623,"Djelatnosti stomatološke prakse"]
[8690,"Ostale djelatnosti zdravstvene zaštite"]
[8710,"Djelatnosti ustanova za njegu"]
[8720,"Djelatnosti socijalne skrbi sa smještajem za osobe s teškoćama u razvoju, duševno bolesne osobe i osobe ovisne o alkoholu, drogama ili drugim opojnim sredstvima "]
[8730,"Djelatnosti socijalne skrbi sa smještajem za starije osobe i osobe s invaliditetom"]
[8790,"Ostale djelatnosti socijalne skrbi sa smještajem"]
[8810,"Djelatnosti socijalne skrbi bez smještaja za starije osobe i osobe s invaliditetom"]
[8891,"Djelatnosti dnevne skrbi o djeci"]
[8899,"Ostale djelatnosti socijalne skrbi bez smještaja, d. n."]
[9001,"Izvođačka umjetnost"]
[9002,"Pomoćne djelatnosti u izvođačkoj umjetnosti"]
[9003,"Umjetničko stvaralaštvo"]
[9004,"Rad umjetničkih objekata"]
[9101,"Djelatnosti knjižnica i arhiva"]
[9102,"Djelatnosti muzeja"]
[9103,"Rad povijesnih mjesta i građevina te sličnih zanimljivosti za posjetitelje"]
[9104,"Djelatnosti botaničkih i zooloških vrtova i prirodnih rezervata"]
[9200,"Djelatnosti kockanja i klađenja"]
[9311,"Rad sportskih objekata"]
[9312,"Djelatnosti sportskih klubova"]
[9313,"Fitnes centri"]
[9319,"Ostale sportske djelatnosti"]
[9321,"Djelatnosti zabavnih i tematskih parkova"]
[9329,"Ostale zabavne i rekreacijske djelatnosti"]
[9411,"Djelatnosti poslovnih organizacija i organizacija poslodavaca"]
[9412,"Djelatnosti strukovnih članskih organizacija"]
[9420,"Djelatnosti sindikata"]
[9491,"Djelatnosti vjerskih organizacija"]
[9492,"Djelatnosti političkih organizacija"]
[9499,"Djelatnosti ostalih članskih organizacija, d. n."]
[9511,"Popravak računala i periferne opreme"]
[9512,"Popravak komunikacijske opreme"]
[9521,"Popravak elektroničkih uređaja za široku potrošnju"]
[9522,"Popravak aparata za kućanstvo te opreme za kuću i vrt"]
[9523,"Popravak obuće i proizvoda od kože"]
[9524,"Popravak namještaja i pokućstva"]
[9525,"Popravak satova i nakita"]
[9529,"Popravak ostalih predmeta za osobnu uporabu i kućanstvo "]
[9601,"Pranje i kemijsko čišćenje tekstila i krznenih proizvoda"]
[9602,"Frizerski saloni i saloni za uljepšavanje"]
[9603,"Pogrebne i srodne djelatnosti"]
[9604,"Djelatnosti za njegu i održavanje tijela"]
[9609,"Ostale osobne uslužne djelatnosti, d. n."]
[9700,"Djelatnosti kućanstava koja zapošljavaju poslugu"]
[9810,"Djelatnosti privatnih kućanstava koja proizvode različitu robu za vlastite potrebe"]
[9820,"Djelatnosti privatnih kućanstava koja obavljaju različite usluge za vlastite potrebe"]
[9900,"Djelatnosti izvanteritorijalnih organizacija i tijela"]

{"sheet":"Prom","index":10,"n_rows":41,"n_cols":2,"rows_kept":41,"cut":false,"hidden":false,"merged":[[16,1,16,2],[14,1,14,2],[35,1,35,2],[34,1,34,2],[33,1,33,2],[36,1,36,2],[9,1,9,2],[24,1,24,2],[23,1,23,2],[15,1,15,2],[32,1,32,2],[20,1,20,2],[22,1,22,2],[12,1,12,2],[11,1,11,2],[17,1,17,2],[3,1,3,2],[8,1,8,2],[7,1,7,2],[19,1,19,2],[5,1,5,2],[1,0,1,2],[6,1,6,2],[39,1,39,2],[40,1,40,2],[10,1,10,2],[18,1,18,2],[29,1,29,2],[28,1,28,2],[38,1,38,2],[37,1,37,2],[2,1,2,2],[31,1,31,2],[0,0,0,7],[4,1,4,2],[13,1,13,2],[30,1,30,2],[27,1,27,2],[26,1,26,2],[25,1,25,2],[21,1,21,2]]}
["<–––– Povratak na Referentnu stranicu"]
["Na ovom radnom listu dat će se popis svih, i najmanjih promjena Excel datoteke iz verzije u verziju (bilo da su nastale zbog promjene zakonskih propisa, ispravka pogrešaka u Excel datoteci, dodatnim kontrolama ili poboljšanjima obrasca. "]
["Verzija","Opis promjene u odnosu na prethodnu verziju"]
["2.0.0.","Svi obrasci proračuna i proračunskih korisnika objedinjeni su zbog potreba kontrola između obrazaca te lakšu kontrolu obveznosti (koja razina je obvezna podnositi koji obrazac)."]
["2.0.0.","Uvedena su polja \"Datum od\" i \"Datum do\" svakog pojedinog razdoblja kako bi se moglo posebno prepoznati obveznike koji nisu poslovali cijelo navedeno razdoblje (novootvoreni obveznici i obveznici koji zbog statusnih promjena gube pravnu osobnost)."]
["2.0.0.","Programskim kućama koje izrađuju aplikacije za punjenje obrazaca olakšan je postao jer se za sve obrasce i sve vrste posla unosi jedno jedinstveno zaglavlje, u svakom obrascu AOP oznake upisane su u koloni \"C\", dok svi iznosi (bez obzira na broj kolona) počinju u koloni \"D\", u 12. retku. Od ovoga se više neće odstupati osim ako ne bude nikakve druge mogućnosti da se unesu potrebne promjene."]
["2.0.1.","Popravljeni su pogrešni naslovi nekih obrazaca. Dodana je kontrola da se u poštanski broj ne može unijeti nešto što nije broj između 10000 i 60000. Popravljena je kontrola upozorenja na S-PR-RAS obrascu koja je krivo izračunavala razradu konta 32 (kontrola pod rednim brojem 90)"]
["2.0.2.","Ispravljena kontrola u PR-RAS obrascu koja je AOP 010 zbrajala u AOP oznaku 003, umjesto da je oduzimala od sume svih ostalih AOP oznaka."]
["2.0.3.","Ispravljena kontrola upozorenja na broj zaposlenih u PR-RAS obrascu preko 1000 kada to nije. Ispravljena kontrola koja je za polugodište javljala pogrešku da se za razinu 23 ne predaje obrazac Obveze. Svi obveznici (ne više samo oni kojima je razdjel ujedno i glava) razina 11 i 12 trebaju upisati razdjel, a ostali obveznici ne mogu."]
["2.0.3.","Upisom razine 11 ili 12 u zaglavlju obrasca obveze automatski se pojavljuje oznaka da je obrazac mjesečni, a ne kvartalni. Promijenjeni su opisi obveznosti predaje prema razinama, grupirani na mjesečnu obvezu, kvartalnu, polugodišnju i godišnju. Na obrazac obveze, na dnu obrasca dodana crta za potpis zakonskog predstavnika (za dostavu obrasca nadležnim ministarstvima)."]
["2.0.3.","Proširene upute tekstom o upotrebi ove Excel datoteke za dostavu podataka nadležnim ministarstvima ili za neke druge potrebe."]
["2.0.4.","Popravljena kontrola broj 36 u PR-RAS-u koja je provjeravala pogrešne AOP pozicije. \nPopravljena kontrola koja je javljala pogrešku ako je bio popunjen polugodišnji obrazac NT za razine 22 i 23."]
["2.0.5.","Popravljena kontrola broj 9 u kojoj je za razinu 23 traženo da bude upisan i obrazac NT, a stvarno ne treba biti."]
["2.0.6.","Popravljene kontrole broj 7 i 12 (obveznost predaje po razinama 13 i 42) te kontrola 63 - iznosi planiranog za razdoblje i planiranog za cijelu godinu u obrascu PR-RAS moraju biti identični kod godišnjeg obrasca, a za ostala razdoblja iznos planirano za razdoblje mora biti manji ili jednak planiranom za cijelu godinu. "]
["2.0.7.","Popravljena je kontrola broj 63 koja govori da planirano za razdoblje ne može biti veće od planiranoga za godinu. Iznimno, ovakvo stanje dopušteno je kod sumarnih AOP oznaka u kojima se neka vrijednost oduzima (primjerice AOP oznaka 222 ili 223) jer se računaju automatski."]
["2.0.8.","Popravljene kontrole popunjenosti obrazaca za razine 13, 31, 41 i 42 na godišnjoj razini. Dodan je razdjel 095, Izbrisan je razdjel 065 (sa starim nazivom, ostao samo s novim), promijenjen opis kontrole P-VRIO obrasca (naglašavanje da se oznaka DA ili NE na referentnoj stranici mora upisati ručno)."]
["2.0.9.","Dodana mogućnost odabira svih razdoblje za 2010. godinu, dodani novi razdjeli za 2010."]
["2.1.0.","Popravljen je prikaz datuma od i do na nekim obrascima koji se je poremetio ubacivanjem novih razdoblja za 2010."]
["2.1.0.","Dorađena su poslovna pravila o popunjavanju obrasca, kolona planirano za razdoblje i planirano ukupno popunjavaju se samo na trećoj razini kontnog plana, a ne na četvrtoj kako je bilo ranije, te je obrazac dorađen u skladu s tim pravilom."]
["2.5.0.","Omogućen je unos samo obrasca Obveze (mjesečne) za razdoblja siječanj i veljaču 2011. Ostali obrasci će se mijenjati i čekaju se izmjene. Zbog toga je Obveze dobio novu šifru vrste posla."]
["2.9.0.","Omogućen unos obrazaca za I. kvartal 2011. godine - nepotpune kontrole."]
["2.9.1.","Omogućen unos obrasca Obveze za travanj 2011. godine"]
["4.0.0.","Novi obrazac od 1.1.2015. - prva verzija obrasca, omogućen samo unos mjesečnog obrasca Obveze za siječanj 2015. godine"]
["4.0.1.","Omogućen unos mjesečnih obveza za veljaču. Ostale vrste obrazaca još nemaju kontrole."]
["4.0.2.","Ugrađene su sve kontrole za sve obrasce. Omogućen je unos za sva razdoblja u 2015. godini. Dodan je opis novosti i promjena kod predaje u Upute. Ažuriran je popis razdjela za 2015. godinu."]
["4.0.3.","Ispravljena kontrola broj 23. Pogrešno je upozoravala na AOP 646, umjesto na 649."]
["4.0.4.","Kontrola upozorenja broj 156 je obrisana jer više nema u dodatnim podacima razrade koja je bila prije za ovaj konto. Ispravljena je kontrola 147 koja nije dopuštala da razina 11 ima upisan broj zaposlenih u tijelima s obzirom da nadležna ministarstva imaju te zaposlene, a oni također predaju izvještaje razine 11. Ispravljena je kontrola 58. koja nije dobro radila na koloni tekuće godine. Ispravljena je automatska suma na AOP oznaci 224 u koloni prethodne godine u Bilanci. Unesene su sitne ispravke \"tipfelera\" u nekim kontrolama."]
["4.0.5.","Opis AOP oznake 639 je ispravljen, glasio je \"Rashodi budućih razdoblja\", novi opis je \"Unaprijed plaćeni rashodi budućih razdoblja\". Ispravljena pogrešna formula na AOP-u 407. Ispravljena je pogrešna formula u kontroli 028."]
["4.0.6.","Ispravljene su pogreške u obrascu Obveze zbog kojih se podaci pod AOP oznakama 095 do 101 nisu uopće učitavali u aplikaciju. Iz tog razloga neće se više moći učitati bilo koji obrazac iz verzije niže od 4.0.6. Dodane su nova kontrola broj 52 i 53  (svim bivšim kontrolama iza 51 povećan je broj za 2). Ispravljen je opis što se sumira pod AOP oznakama 405 i 406. Formula je bila dobra. Ispravljen je i opis i formula za sumu na AOP oznaci 407. Proširena je lista AOP-a koji nesmiju biti popunjeni za razinu 22 i 23 - dodani su AOP-i 132 i 133 u kontrolu 153 (bivša kontrola 151). Adresa e-pošte za kontakt u zaglavlju stavljena je kao obvezan podatak zbog česte potrebe kontaktiranja obveznika, a koje je nemoguće kontaktirati putem telefona."]
["4.0.7.","Kontrola 153 podijeljena je na dvije kontrole, jer se zabrane popunjavanja nekih AOP pozicija razlikuju kod razine 22 i 23. Za razinu 23 dopušteno je popunjavanje AOP pozicija 128 do 133."]
["4.0.8.","Omogućen je unos mjesečnih Obveza i za razinu 11. Nova Bilanca za 2015. još nije ugrađena u obrazac."]
["4.0.9.","Ispravljena je kontrola broj 66 koja je pogrešno glasila \"AOP 423 mora biti jedna sumi AOP-a 496+498\", ispravno je da treba glasiti \"AOP423 mora biti jednak sumi AOP-a 496 do 498\", tj. i AOP oznaka 497 ulazi u kontrolu sume. Ispravljen je i opus i formula za ovu kontrolu."]
["4.1.0.","Ugrađena je nova Bilanca koja vrijedi od 2015. godine. Kontrole 15 i 16 su dorađene i spojene u jednu (kontrola 15, a stara kontrola 16 je obrisana te je broj kontrola manji). S proširenjem broja AOP oznaka u dodatnim podacima u Bilanci promijenjeni su opisi kontrola 224 do 232 u Bilanci, tj. kontrole se nisu mijenjali ali su opisi prilagođeni novim AOP oznakama. Dodano je 7 novih kontrola na obrazac Bilancu. Kako se obrazac Bilanca promijenio, dodana mu je nova (stara) šifra vrste posla 152."]
["4.2.0.","Ukinuti su mjesečni obrasci Obveze za sve vrste obveznika. Izmjijenjen je opis AOP oznake 639 u PR-RAS-u te AOP 001 u obrascu Obveze. Obrazac obveze predaje se za cijelo razdoblje, od početka godine do datuma izvještavanja, ne samo za kvartal (tj. obveze na dan 30.06 predaju se za razdoblje 1.1. do 30.06. ne više za razdoblje 1.4. do 30.06.). Izmijenjena je kontrola 153. Dorađena je kontrola broj 16. Promijenjena je obveznost po razdobljima i razinama u odnosu na prethodnu godinu. U kontrole 148 do 156 dopuštene su iznimke na neke AOP oznake te za neke korisnike."]
["4.2.1.","Ispravljen je opis vrste posla na samom radnom listu izvještaja o Obvezama (VP 159, a ne VP 160). Ispravljen je datum koji se prikazuje na izvještaju o obvezama, nije od 1. u mjesecu do kraja mjesece već od 1. siječnja do kraja razdoblja jer više mjesečnih obveza nema. Ova izmjena ne utječe na funkcionalnost obrasca, napravljena je samo iz razloga da ne zbunjuje korisnike, tj. da ne smatraju kako se radi o mjesečnom izvještaju obveze. Ako ste već izvještaj ispunili u verziji 4.2.0. nije potrebno prebacivati u novu verziju."]
["4.2.2.","Dodan komentar u obrazac Obveze na AOP oznaku 001. Ispravljen pogrešan opis AOP oznake 639. Ispravljena kontrola 13 koja je pogreškom uspoređivala AOP 639 iz PR-RAS obrasca i 159 iz Bilance. Ispravno je da je uspoređuje sa AOP oznakom 158 iz Bilance."]
["4.2.3.","Ispravljena je kontrola broj 16 koja nije uzimala u obzir iznos prikazan na AOP oznaci 234 PR-RAS-a. Ispravljen opis kontrole 13 koji je kod zadnje izmjene greškom ostao 159. Obveznici koji nisu imali popunjen iznos na AOP 234 ni u jednoj godini mogu predati i na starijoj verziji obrasca jer im ova kontrola neće javljati pogrešku."]
["5.0.1.","Nova verzija obrasca za 2017. Promijenio se broj AOP oznaka kod 3 obrasca pa su svi obrasci i kontrole novi."]
["5.0.2.","Dorađene kontrole izuzetaka koji mogu imati popunjen AOP 031 (a time i 024) za razinu 11, tj. kontrola 154 je podijeljena na 154. i 155., a kontrola 157 na 158 i 159, pa se i broj kontrola povećao za 2. Ispravljena kontrola 14. umjesto AOP-a 159 kontrolira se AOP 158. Popravljene neke kontrole koje ne dopuštaju da neka razina ima popunjen neki određeni AOP."]
["5.0.3.","Na listu AOP oznaka koje ne mogu biti popunjene kod razine 23 dodane su AOP oznake: 069 do 073 i 241 do 245. Obrazac eventualno popunjen u verziji 5.0.2. može se predati ako je zadovoljen ovaj uvjet da za razinu 23 nisu popunjene te AOP oznake. Ispravljena kontrola 172, greškom je javljala pogrešku ako je popunjen AOP 695, a ne 685."]
["5.0.4.","Ispravljene kontrole 202 i 203 koje su provjeravale pogrešne AOP oznake u koloni tekuće godine. Ponovo je ispravljena kontrola 177, tj. isključen je AOP 246 iz liste onih koji ne mogu biti popunjeni. Popravljena je kontrola 168 koja se javljala kod razine 12 umjesto kod razine 13. Kontrole na razinu 12 nisu radile ako je bila upisana razina 11 i kad je izvještaj imao oznaku da vrijedi i kao konsolidirani.Ispravljena je kontrola 205 koja je greškom uspoređivala AOP-e 210 i 729, a treba 211 i 729."]